{"text_format":"3","workbook":"xlsx","n_sheets":12,"sheets":["CoverSheet","DCI by technology","Stat analysis DCI by tech","LCCI by technology","Stat analysis LCCI by tech","DCI by country","LCCI by country","Stat analysis DCI 2017","Stat analysis DCI 2023","Stat analysis LCCI 2017","Stat analysis LCCI 2023","Data Sources' Details"],"not_rendered":{"images":3,"external_links":1,"defined_names":2},"read":"whole","date_system":"1900"}

{"sheet":"CoverSheet","index":0,"n_rows":23,"n_cols":1,"rows_kept":23,"merged":[[4,0,5,8],[8,0,9,7]]}
["Journal of Industrial Ecology – www.wileyonlinelibrary.com/journal/jie"]
[]
["           SUPPORTING INFORMATION FOR:"]
[]
["Citterio, C., Golinucci, N., Rinaldi, L. & Rocco, M. V. Carbon footprint of electricity: a systematic methodological and quantitative review. Journal of Industrial Ecology. "]
[]
{"$rows_left_out":18}
{"sheet":"DCI by technology","index":1,"n_rows":478,"n_cols":8,"rows_kept":478}
["Source","Technology_aggr","Technology","Country","GWP100","Unit","Notes","Data from figure 1a in manuscript"]
["Electricity Maps","Natural Gas","NG","AT",380,"g/kWh","EU-ETS, ENTSO-E 2023"]
["Electricity Maps","Natural Gas","NG","CZ",364.25,"g/kWh","EU-ETS, ENTSO-E 2023"]
["Electricity Maps","Natural Gas","NG","US",406.03429619999997,"g/kWh","eGrid 2020"]
["Electricity Maps","Natural Gas","NG","NL",404.39,"g/kWh","EU-ETS, ENTSO-E 2023"]
["Electricity Maps","Natural Gas","NG","IE",473.89,"g/kWh","EU-ETS, ENTSO-E 2023"]
{"$rows_left_out":473}
{"sheet":"Stat analysis DCI by tech","index":2,"n_rows":24,"n_cols":12,"rows_kept":24}
["Technology","Source","n","Lower whisker\n(g/kWh)","Q1\n(g/kWh)","Median\n(g/kWh)","Q3\n(g/kWh)","Upper whisker\n(g/kWh)","IQR\n(g/kWh)","Mean\n(g/kWh)","Std Dev\n(g/kWh)","CV%"]
["Biomass and waste","EXIO Hybrid",23,0.5981668219307329,2.303309279616205,6.107401040836938,10.87709682321717,17.78695980632301,8.573787543600968,7.277602812955934,5.488242433561939,0.754127777321333]
["Biomass and waste","Electricity Maps",28,0,0,0,0,0,0,0,0]
["Coal","EXIO Hybrid",23,720.7722904534414,889.828280320776,927.3420213983467,1027.13737593101,1204.071341521711,137.3090956102335,947.7173321566189,107.7721257306462,0.1137175844250951]
["Coal","Electricity Maps",28,923.04,1014.525,1037.31,1076.345,1123.53,61.81999999999994,1031.724119928571,140.2291652713226,0.13591730828298462]
["Coal","IPCC",3,670,715,760,815,870,100,766.6666666666666,100.1665280087781,0.13065199305492797]
{"$rows_left_out":19}
{"sheet":"LCCI by technology","index":3,"n_rows":2229,"n_cols":8,"rows_kept":2229}
["Source","Technology_aggr","Technology","Country","GWP100","Unit","Notes","Data from figure 1b in manuscript"]
["Electricity Maps","Natural Gas","NG","AT",500,"g/kWh","EU-ETS, ENTSO-E 2023; IPCC 2014"]
["Electricity Maps","Natural Gas","NG","CZ",484.25,"g/kWh","EU-ETS, ENTSO-E 2023; IPCC 2014"]
["Electricity Maps","Natural Gas","NG","BE",513.56,"g/kWh","EU-ETS, ENTSO-E 2023; IPCC 2014"]
["Electricity Maps","Natural Gas","NG","DE",529.62,"g/kWh","EU-ETS, ENTSO-E 2023; IPCC 2014"]
["Electricity Maps","Natural Gas","NG","PT",495.95,"g/kWh","EU-ETS, ENTSO-E 2023; IPCC 2014"]
{"$rows_left_out":2224}
{"sheet":"Stat analysis LCCI by tech","index":4,"n_rows":44,"n_cols":12,"rows_kept":44}
["Technology","Source","n","Lower whisker\n(g/kWh)","Q1\n(g/kWh)","Median\n(g/kWh)","Q3\n(g/kWh)","Upper whisker\n(g/kWh)","IQR\n(g/kWh)","Mean\n(g/kWh)","Std Dev\n(g/kWh)","CV%"]
["Biomass and waste","EXIO Hybrid",23,{"v":22.55168624900715,"d":"22.6"},{"v":35.51568537214875,"d":"35.5"},{"v":51.28202025620563,"d":"51.3"},{"v":154.2141748853379,"d":"154.2"},{"v":306.9448128285441,"d":"306.9"},{"v":118.6984895131892,"d":"118.7"},{"v":110.0445812892324,"d":"110.0"},{"v":109.8936279686611,"d":"109.9"},{"$f":"K2/J2","v":{"v":0.998628253033427,"d":"100%"}}]
["Biomass and waste","Ecoinvent",169,{"v":0,"d":"0.0"},{"v":45.63551203655669,"d":"45.6"},{"v":49.04978252515544,"d":"49.0"},{"v":171.8730524484979,"d":"171.9"},{"v":323.0819066840028,"d":"323.1"},{"v":126.2375404119412,"d":"126.2"},{"v":95.1965110958287,"d":"95.2"},{"v":101.9353392738399,"d":"101.9"},{"v":1.0707886045448411,"d":"107%"}]
["Biomass and waste","Electricity Maps",28,{"v":230,"d":"230.0"},{"v":230,"d":"230.0"},{"v":230,"d":"230.0"},{"v":230,"d":"230.0"},{"v":230,"d":"230.0"},{"v":0,"d":"0.0"},{"v":231.9943308607143,"d":"232.0"},{"v":10.55300697886279,"d":"10.6"},{"v":0.04548821059424356,"d":"5%"}]
["Biomass and waste","IPCC",3,{"v":130,"d":"130.0"},{"v":180,"d":"180.0"},{"v":230,"d":"230.0"},{"v":560,"d":"560.0"},{"v":890,"d":"890.0"},{"v":380,"d":"380.0"},{"v":416.6666666666667,"d":"416.7"},{"v":412.9568177586288,"d":"413.0"},{"v":0.9910963626207091,"d":"99%"}]
["Coal","EXIO Hybrid",23,{"v":1174.35590033162,"d":"1174.4"},{"v":1346.164760182009,"d":"1346.2"},{"v":1651.71689875664,"d":"1651.7"},{"v":1752.987390330794,"d":"1753.0"},{"v":2103.588007285959,"d":"2103.6"},{"v":406.8226301487853,"d":"406.8"},{"v":1602.61071693055,"d":"1602.6"},{"v":256.6748152872374,"d":"256.7"},{"v":0.1601604260945177,"d":"16%"}]
{"$rows_left_out":39}
{"sheet":"DCI by country","index":5,"n_rows":324,"n_cols":8,"rows_kept":324}
["Country","Year","DB type","Source","GWP100","Unit","Notes","Data from figure 2 in manuscript"]
["BE",2017,"Physical","JRC",217.128376783737,"g/kWh"]
["BG",2017,"Physical","JRC",658.4280191584099,"g/kWh"]
["CZ",2017,"Physical","JRC",659.618779950752,"g/kWh"]
["DK",2017,"Physical","JRC",140.558131432961,"g/kWh"]
["DE",2017,"Physical","JRC",474.827287854926,"g/kWh"]
{"$rows_left_out":319}
{"sheet":"LCCI by country","index":6,"n_rows":562,"n_cols":8,"rows_kept":562}
["Country","Year","DB type","Source","GWP100","Unit","Notes","Data from figure 2 in manuscript"]
["BE",2017,"Physical","JRC",{"v":230.388555151416,"d":"230.389"},"g/kWh"]
["BG",2017,"Physical","JRC",{"v":573.845753702202,"d":"573.846"},"g/kWh"]
["CZ",2017,"Physical","JRC",{"v":624.089843691911,"d":"624.090"},"g/kWh"]
["DK",2017,"Physical","JRC",{"v":170.596875513752,"d":"170.597"},"g/kWh"]
["DE",2017,"Physical","JRC",{"v":441.606336190274,"d":"441.606"},"g/kWh"]
{"$rows_left_out":557}
{"sheet":"Stat analysis DCI 2017","index":7,"n_rows":30,"n_cols":22,"rows_kept":30,"merged":[[0,10,0,19],[0,20,0,21]]}
[null,"Physical","Physical","Hybrid","Monetary","Monetary","Monetary","Monetary","Monetary","Monetary","Stats",{"$nulls":9},"Sources comparison"]
["Paese","Electricity Maps","JRC","EXIO Hybrid","EORA 199.82","EXIOBASE 3.10 ixi","EXIOBASE 3.10 pxp","GLORIA 0.6 act","GTAP 11","EMERGING 1","Median","Mean","Standard dev","CV%","Min","Max","Relative \ndispersion%","Q1","Q2","IQR","Source min","Source max"]
["AT",{"v":90.4851354012873,"d":"90.5"},{"v":315.531034200812,"d":"315.5"},{"v":154.308800429182,"d":"154.3"},{"v":47.7123745145757,"d":"47.7"},{"v":24.8676990281184,"d":"24.9"},{"v":18.7475724415882,"d":"18.7"},{"v":54.6250936635903,"d":"54.6"},{"v":198.515256247341,"d":"198.5"},{"v":24.2727115600944,"d":"24.3"},{"$f":"MEDIAN(B3:J3)","v":{"v":54.6250936635903,"d":"54.6"}},{"$f":"AVERAGE(B3:J3)","v":{"v":103.22951972073214,"d":"103.2"}},{"$f":"_xlfn.STDEV.S(B3:J3)","v":{"v":101.16775205244937,"d":"101.2"}},{"$f":"M3/L3","v":{"v":0.9800273441757698,"d":"1.0"}},{"$f":"MIN(B3:J3)","v":{"v":18.7475724415882,"d":"18.7"}},{"$f":"MAX(B3:J3)","v":{"v":315.531034200812,"d":"315.5"}},{"$f":"(P3-O3)/K3","v":{"v":5.4330975354837925,"d":"543%"}},{"$f":"QUARTILE(B3:J3,1)","v":{"v":24.8676990281184,"d":"24.9"}},{"$f":"QUARTILE(B3:J3,3)","v":{"v":154.308800429182,"d":"154.3"}},{"$f":"QUARTILE(B3:J3,3)-QUARTILE(B3:I3,1)","v":{"v":112.30759478622065,"d":"112.3"}},{"$f":"INDEX($B$2:$J$2,MATCH(O3,B3:J3,0))","v":"EXIOBASE 3.10 pxp"},{"$f":"INDEX($B$2:$J$2,MATCH(P3,B3:J3,0))","v":"JRC"}]
["BE",{"v":141.314889698449,"d":"141.3"},{"v":217.128376783737,"d":"217.1"},{"v":185.213931629819,"d":"185.2"},{"v":159.507588635767,"d":"159.5"},{"v":120.054415132635,"d":"120.1"},{"v":103.125201265044,"d":"103.1"},{"v":140.960598870637,"d":"141.0"},{"v":188.047078175302,"d":"188.0"},{"v":20.4200307981398,"d":"20.4"},{"$f":"MEDIAN(B4:J4)","v":{"v":141.314889698449,"d":"141.3"}},{"$f":"AVERAGE(B4:J4)","v":{"v":141.75245677661442,"d":"141.8"}},{"$f":"_xlfn.STDEV.S(B4:J4)","v":{"v":57.786364923280956,"d":"57.8"}},{"$f":"M4/L4","v":{"v":0.4076568846658201,"d":"0.4"}},{"$f":"MIN(B4:J4)","v":{"v":20.4200307981398,"d":"20.4"}},{"$f":"MAX(B4:J4)","v":{"v":217.128376783737,"d":"217.1"}},{"$f":"(P4-O4)/K4","v":{"v":1.391985985378837,"d":"139%"}},{"$f":"QUARTILE(B4:J4,1)","v":{"v":120.054415132635,"d":"120.1"}},{"$f":"QUARTILE(B4:J4,3)","v":{"v":185.213931629819,"d":"185.2"}},{"$f":"QUARTILE(B4:J4,3)-QUARTILE(B4:I4,1)","v":{"v":49.47987869368251,"d":"49.5"}},"EMERGING 1","JRC"]
["BG",{"v":545.012194430927,"d":"545.0"},{"v":658.42801915841,"d":"658.4"},{"v":542.045782200647,"d":"542.0"},{"v":217.288361785935,"d":"217.3"},{"v":379.965205810826,"d":"380.0"},{"v":407.8823770168,"d":"407.9"},{"v":597.028477202797,"d":"597.0"},{"v":403.521627936209,"d":"403.5"},{"v":482.600423513271,"d":"482.6"},{"v":482.600423513271,"d":"482.6"},{"v":470.41916322842474,"d":"470.4"},{"v":133.6335358143365,"d":"133.6"},{"v":0.2840733249411592,"d":"0.3"},{"v":217.288361785935,"d":"217.3"},{"v":658.42801915841,"d":"658.4"},{"v":0.914088831835317,"d":"91%"},{"v":403.521627936209,"d":"403.5"},{"v":545.012194430927,"d":"545.0"},{"v":147.37967202606382,"d":"147.4"},"EORA 199.82","JRC"]
["CY",null,{"v":722.279491964097,"d":"722.3"},null,{"v":454.296189354355,"d":"454.3"},{"v":441.622367376683,"d":"441.6"},{"v":442.8285894779,"d":"442.8"},{"v":497.205335078337,"d":"497.2"},{"v":117.120823501161,"d":"117.1"},{"v":260.573449773239,"d":"260.6"},{"v":442.8285894779,"d":"442.8"},{"v":419.4180352179675,"d":"419.4"},{"v":190.02136046251522,"d":"190.0"},{"v":0.45305958377245975,"d":"0.5"},{"v":117.120823501161,"d":"117.1"},{"v":722.279491964097,"d":"722.3"},{"v":1.36657542634369,"d":"137%"},{"v":351.097908574961,"d":"351.1"},{"v":475.750762216346,"d":"475.8"},{"v":33.82683931435878,"d":"33.8"},"GTAP 11","JRC"]
{"$rows_left_out":25}
{"sheet":"Stat analysis DCI 2023","index":8,"n_rows":30,"n_cols":17,"rows_kept":30,"merged":[[0,5,0,14],[0,15,0,16]]}
[null,"Physical","Hybrid","Monetary","Monetary","Stats",{"$nulls":9},"Sources comparison"]
["Paese","Electricity Maps","EXIO Hybrid","GLORIA 0.6 act","EMERGING 2","Median","Mean","Standard dev","CV%","Min","Max","Relative \ndispersion%","Q1","Q2","IQR","Source min","Source max"]
["AT",{"v":43.1470856352684,"d":"43.1"},{"v":86.778732693504,"d":"86.8"},{"v":127.905232091796,"d":"127.9"},{"v":214.036940135864,"d":"214.0"},{"$f":"MEDIAN(B3:E3)","v":{"v":107.34198239265,"d":"107.3"}},{"$f":"AVERAGE(B3:E3)","v":{"v":117.96699763910809,"d":"118.0"}},{"$f":"_xlfn.STDEV.S(B3:E3)","v":{"v":72.79864801387937,"d":"72.8"}},{"$f":"H3/G3","v":{"v":0.6171102890707576,"d":"0.6"}},{"$f":"MIN(B3:E3)","v":{"v":43.1470856352684,"d":"43.1"}},{"$f":"MAX(B3:E3)","v":{"v":214.036940135864,"d":"214.0"}},{"$f":"(K3-J3)/F3","v":{"v":1.5920132150670707,"d":"159%"}},{"$f":"QUARTILE(B3:E3,1)","v":{"v":75.8708209289451,"d":"75.9"}},{"$f":"QUARTILE(B3:E3,3)","v":{"v":149.438159102813,"d":"149.4"}},{"$f":"QUARTILE(B3:E3,3)-QUARTILE(B3:D3,1)","v":{"v":84.4752499384268,"d":"84.5"}},{"$f":"INDEX($B$2:$E$2,MATCH(J3,B3:E3,0))","v":"Electricity Maps"},{"$f":"INDEX($B$2:$E$2,MATCH(K3,B3:E3,0))","v":"EMERGING 2"}]
["BE",{"v":121.141616391957,"d":"121.1"},{"v":135.436494016862,"d":"135.4"},{"v":146.677798234752,"d":"146.7"},{"v":185.720995189695,"d":"185.7"},{"$f":"MEDIAN(B4:E4)","v":{"v":141.057146125807,"d":"141.1"}},{"$f":"AVERAGE(B4:E4)","v":{"v":147.24422595831652,"d":"147.2"}},{"$f":"_xlfn.STDEV.S(B4:E4)","v":{"v":27.698082789402715,"d":"27.7"}},{"$f":"H4/G4","v":{"v":0.1881098060663091,"d":"0.2"}},{"$f":"MIN(B4:E4)","v":{"v":121.141616391957,"d":"121.1"}},{"$f":"MAX(B4:E4)","v":{"v":185.720995189695,"d":"185.7"}},{"$f":"(K4-J4)/F4","v":{"v":0.4578242263609992,"d":"46%"}},{"$f":"QUARTILE(B4:E4,1)","v":{"v":131.86277461063577,"d":"131.9"}},{"$f":"QUARTILE(B4:E4,3)","v":{"v":156.43859747348776,"d":"156.4"}},{"$f":"QUARTILE(B4:E4,3)-QUARTILE(B4:D4,1)","v":{"v":28.14954226907824,"d":"28.1"}},"Electricity Maps","EMERGING 2"]
["BG",{"v":405.077249098493,"d":"405.1"},{"v":405.83521384196,"d":"405.8"},{"v":371.41173715937,"d":"371.4"},{"v":185.440453483218,"d":"185.4"},{"v":388.2444931289315,"d":"388.2"},{"v":341.9411633957602,"d":"341.9"},{"v":105.56135959931943,"d":"105.6"},{"v":0.30871205604790986,"d":"0.3"},{"v":185.440453483218,"d":"185.4"},{"v":405.83521384196,"d":"405.8"},{"v":0.5676700230376519,"d":"57%"},{"v":324.918916240332,"d":"324.9"},{"v":405.26674028435974,"d":"405.3"},{"v":17.02224715542826,"d":"17.0"},"EMERGING 2","EXIO Hybrid"]
["CY",null,null,{"v":1061.70940797381,"d":"1,061.7"},{"v":316.483937191983,"d":"316.5"},{"v":689.0966725828964,"d":"689.1"},{"v":689.0966725828964,"d":"689.1"},{"v":526.9539839027673,"d":"527.0"},{"v":0.7647025517154507,"d":"0.8"},{"v":316.483937191983,"d":"316.5"},{"v":1061.70940797381,"d":"1061.7"},{"v":1.0814527198173032,"d":"108%"},{"v":502.79030488743973,"d":"502.8"},{"v":875.4030402783533,"d":"875.4"},{"v":-186.30636769545663,"d":"-186.3"},"EMERGING 2","GLORIA 0.6 act"]
{"$rows_left_out":25}
{"sheet":"Stat analysis LCCI 2017","index":9,"n_rows":30,"n_cols":26,"rows_kept":30,"merged":[[0,14,0,23],[0,24,0,25]]}
[null,"Physical","Physical","Physical","Physical","Physical","Hybrid","Monetary","Monetary","Monetary","Monetary","Monetary","Monetary","Monetary","Stats",{"$nulls":9},"Sources comparison"]
["Paese","Electricity Maps","EMBER","IPCC","JRC","NREL","EXIO Hybrid","EORA 199.82","EXIOBASE 3.10 ixi","EXIOBASE 3.10 pxp","GLORIA 0.6 act","GLORIA 0.6 com","GTAP 11","EMERGING 1","Median","Mean","Standard dev","CV%","Min","Max","Relative \ndispersion%","Q1","Q2","IQR","Source min","Source max"]
["AT",{"v":156,"d":"156.0"},{"v":163,"d":"163.0"},{"v":131.242990075727,"d":"131.2"},{"v":292.54487493272,"d":"292.5"},{"v":126.763079335538,"d":"126.8"},{"v":430.33541285864,"d":"430.3"},{"v":103.247267457186,"d":"103.2"},{"v":73.6006465109312,"d":"73.6"},{"v":64.26481545102,"d":"64.3"},{"v":155.194050018065,"d":"155.2"},{"v":155.192090041063,"d":"155.2"},{"v":252.466224046482,"d":"252.5"},{"v":66.4088106037095,"d":"66.4"},{"$f":"MEDIAN(B3:N3)","v":{"v":155.192090041063,"d":"155.2"}},{"$f":"AVERAGE(B3:N3)","v":{"v":166.9430970254678,"d":"166.9"}},{"$f":"_xlfn.STDEV.S(B3:N3)","v":{"v":103.7568572231564,"d":"103.8"}},{"$f":"Q3/P3","v":{"v":0.6215103174186825,"d":"0.6"}},{"$f":"MIN(B3:N3)","v":{"v":64.26481545102,"d":"64.3"}},{"$f":"MAX(B3:N3)","v":{"v":430.33541285864,"d":"430.3"}},{"$f":"(T3-S3)/O3","v":{"v":2.3588225231760176,"d":"236%"}},{"$f":"QUARTILE(B3:N3,1)","v":{"v":103.247267457186,"d":"103.2"}},{"$f":"QUARTILE(B3:N3,3)","v":{"v":163,"d":"163.0"}},{"$f":"QUARTILE(B3:N3,3)-QUARTILE(B3:M3,1)","v":{"v":42.115873634050004,"d":"42.1"}},{"$f":"INDEX($B$2:$N$2,MATCH(S3,B3:N3,0))","v":"EXIOBASE 3.10 pxp"},{"$f":"INDEX($B$2:$N$2,MATCH(T3,B3:N3,0))","v":"EXIO Hybrid"}]
["BE",{"v":203,"d":"203.0"},{"v":159,"d":"159.0"},{"v":163.10527269323,"d":"163.1"},{"v":230.388555151416,"d":"230.4"},{"v":163.018461452407,"d":"163.0"},{"v":322.754849089848,"d":"322.8"},{"v":209.198119875687,"d":"209.2"},{"v":150.603430578194,"d":"150.6"},{"v":133.058553638512,"d":"133.1"},{"v":187.505965899844,"d":"187.5"},{"v":187.508640749927,"d":"187.5"},{"v":235.624318285158,"d":"235.6"},{"v":80.1962169691393,"d":"80.2"},{"$f":"MEDIAN(B4:N4)","v":{"v":187.505965899844,"d":"187.5"}},{"$f":"AVERAGE(B4:N4)","v":{"v":186.5355680294894,"d":"186.5"}},{"$f":"_xlfn.STDEV.S(B4:N4)","v":{"v":58.448158963418265,"d":"58.4"}},{"$f":"Q4/P4","v":{"v":0.3133351970396241,"d":"0.3"}},{"$f":"MIN(B4:N4)","v":{"v":80.1962169691393,"d":"80.2"}},{"$f":"MAX(B4:N4)","v":{"v":322.754849089848,"d":"322.8"}},{"$f":"(T4-S4)/O4","v":{"v":1.293604877885704,"d":"129%"}},{"$f":"QUARTILE(B4:N4,1)","v":{"v":159,"d":"159.0"}},{"$f":"QUARTILE(B4:N4,3)","v":{"v":209.198119875687,"d":"209.2"}},{"$f":"QUARTILE(B4:N4,3)-QUARTILE(B4:M4,1)","v":{"v":47.184273786381766,"d":"47.2"}},{"$f":"INDEX($B$2:$N$2,MATCH(S4,B4:N4,0))","v":"EMERGING 1"},{"$f":"INDEX($B$2:$N$2,MATCH(T4,B4:N4,0))","v":"EXIO Hybrid"}]
["BG",{"v":552,"d":"552.0"},{"v":503,"d":"503.0"},{"v":414.849096775665,"d":"414.8"},{"v":573.845753702202,"d":"573.8"},{"v":489.598867516456,"d":"489.6"},{"v":816.818512395285,"d":"816.8"},{"v":386.525992743165,"d":"386.5"},{"v":418.167885316954,"d":"418.2"},{"v":443.016560952193,"d":"443.0"},{"v":731.602530955137,"d":"731.6"},{"v":731.593845601563,"d":"731.6"},{"v":507.905813758151,"d":"507.9"},{"v":749.402474932384,"d":"749.4"},{"v":507.905813758151,"d":"507.9"},{"v":562.9482565114733,"d":"562.9"},{"v":146.2720757533383,"d":"146.3"},{"v":0.25983218539439096,"d":"0.3"},{"v":386.525992743165,"d":"386.5"},{"v":816.818512395285,"d":"816.8"},{"v":0.8471895930236624,"d":"85%"},{"v":443.016560952193,"d":"443.0"},{"v":731.593845601563,"d":"731.6"},{"v":294.78945355817973,"d":"294.8"},"EORA 199.82","EXIO Hybrid"]
["CY",{"v":897,"d":"897.0"},{"v":606,"d":"606.0"},{"v":0,"d":"0.0"},{"v":858.811902888308,"d":"858.8"},null,null,{"v":789.361158218997,"d":"789.4"},{"v":507.015568224276,"d":"507.0"},{"v":508.760375106235,"d":"508.8"},{"v":554.3883511612,"d":"554.4"},{"v":554.383790979382,"d":"554.4"},{"v":170.42295534131,"d":"170.4"},{"v":439.988045359648,"d":"440.0"},{"v":554.383790979382,"d":"554.4"},{"v":535.1029224799414,"d":"535.1"},{"v":271.2988406915432,"d":"271.3"},{"v":0.5070031003273262,"d":"0.5"},{"v":0,"d":"0.0"},{"v":897,"d":"897.0"},{"v":1.618012673883101,"d":"162%"},{"v":473.50180679196205,"d":"473.5"},{"v":697.6805791094985,"d":"697.7"},{"v":190.2288091647327,"d":"190.2"},"IPCC","Electricity Maps"]
{"$rows_left_out":25}
{"sheet":"Stat analysis LCCI 2023","index":10,"n_rows":30,"n_cols":20,"rows_kept":30,"merged":[[0,8,0,17],[0,18,0,19]]}
[null,"Physical","Physical","Physical","Hybrid","Monetary","Monetary","Monetary","Stats",{"$nulls":9},"Sources comparison"]
["Paese","Electricity Maps","IPCC","NREL","EXIO Hybrid","GLORIA 0.6 act","GLORIA 0.6 com","EMERGING 2","Median","Mean","Standard dev","CV%","Min","Max","Relative \ndispersion%","Q1","Q2","IQR","Source min","Source max"]
["AT",{"v":76,"d":"76.0"},{"v":81.0170509551661,"d":"81.0"},{"v":72.5381567452344,"d":"72.5"},{"v":273.62806176137,"d":"273.6"},{"v":292.822162954947,"d":"292.8"},{"v":292.828107511366,"d":"292.8"},{"$f":"VLOOKUP(A3,[1]physical_efs!$H$254:$J$281,3,FALSE)","v":{"v":448.12948866675,"d":"448.1"}},{"$f":"MEDIAN(B3:H3)","v":{"v":273.62806176137,"d":"273.6"}},{"$f":"AVERAGE(B3:H3)","v":{"v":219.56614694211905,"d":"219.6"}},{"$f":"_xlfn.STDEV.P(B3:H3)","v":{"v":134.86605577954492,"d":"134.9"}},{"$f":"K3/J3","v":{"v":0.6142388417240735,"d":"0.6"}},{"$f":"MIN(B3:H3)","v":{"v":72.5381567452344,"d":"72.5"}},{"$f":"MAX(B3:H3)","v":{"v":448.12948866675,"d":"448.1"}},{"$f":"(N3-M3)/I3","v":{"v":1.3726345518211773,"d":"137%"}},{"$f":"_xlfn.QUARTILE.EXC(B3:H3,1)","v":{"v":76,"d":"76.0"}},{"$f":"_xlfn.QUARTILE.EXC(B3:H3,2)","v":{"v":273.62806176137,"d":"273.6"}},{"$f":"_xlfn.QUARTILE.EXC(B3:H3,3)","v":{"v":292.828107511366,"d":"292.8"}},{"$f":"INDEX($B$2:$H$2,MATCH(M3,B3:H3,0))","v":"NREL"},{"$f":"INDEX($B$2:$H$2,MATCH(N3,B3:H3,0))","v":"EMERGING 2"}]
["BE",{"v":171,"d":"171.0"},{"v":124.021350137246,"d":"124.0"},{"v":125.392651827565,"d":"125.4"},{"v":250.158925542331,"d":"250.2"},{"v":191.24553748733,"d":"191.2"},{"v":191.243489566277,"d":"191.2"},{"$f":"VLOOKUP(A4,[1]physical_efs!$H$254:$J$281,3,FALSE)","v":{"v":246.935554001515,"d":"246.9"}},{"$f":"MEDIAN(B4:H4)","v":{"v":191.243489566277,"d":"191.2"}},{"$f":"AVERAGE(B4:H4)","v":{"v":185.71392979460913,"d":"185.7"}},{"$f":"_xlfn.STDEV.P(B4:H4)","v":{"v":47.243367112293114,"d":"47.2"}},{"$f":"K4/J4","v":{"v":0.2543878489057986,"d":"0.3"}},{"$f":"MIN(B4:H4)","v":{"v":124.021350137246,"d":"124.0"}},{"$f":"MAX(B4:H4)","v":{"v":250.158925542331,"d":"250.2"}},{"$f":"(N4-M4)/I4","v":{"v":0.6595653305174134,"d":"66%"}},{"$f":"_xlfn.QUARTILE.EXC(B4:H4,1)","v":{"v":125.392651827565,"d":"125.4"}},{"$f":"_xlfn.QUARTILE.EXC(B4:H4,2)","v":{"v":191.243489566277,"d":"191.2"}},{"$f":"_xlfn.QUARTILE.EXC(B4:H4,3)","v":{"v":246.935554001515,"d":"246.9"}},{"$f":"INDEX($B$2:$H$2,MATCH(M4,B4:H4,0))","v":"IPCC"},{"$f":"INDEX($B$2:$H$2,MATCH(N4,B4:H4,0))","v":"EXIO Hybrid"}]
["BG",{"v":412,"d":"412.0"},{"v":316.456032872067,"d":"316.5"},{"v":371.443265106922,"d":"371.4"},{"v":615.064984616681,"d":"615.1"},{"v":472.234980473345,"d":"472.2"},{"v":472.233718150969,"d":"472.2"},{"$f":"VLOOKUP(A5,[1]physical_efs!$H$254:$J$281,3,FALSE)","v":{"v":285.670410104918,"d":"285.7"}},{"v":412,"d":"412.0"},{"v":420.7290559035574,"d":"420.7"},{"v":103.2964045953653,"d":"103.3"},{"v":0.24551763931189877,"d":"0.2"},{"v":285.670410104918,"d":"285.7"},{"v":615.064984616681,"d":"615.1"},{"v":0.7995013944460267,"d":"80%"},{"v":316.456032872067,"d":"316.5"},{"v":412,"d":"412.0"},{"v":472.234980473345,"d":"472.2"},"EMERGING 2","EXIO Hybrid"]
["CY",{"v":831,"d":"831.0"},{"$nulls":3},{"v":1341.32764805718,"d":"1,341.3"},{"v":1341.33377291556,"d":"1,341.3"},{"$f":"VLOOKUP(A6,[1]physical_efs!$H$254:$J$281,3,FALSE)","v":{"v":316.484101334841,"d":"316.5"}},{"v":1086.1638240285902,"d":"1,086.2"},{"v":957.5363805768953,"d":"957.5"},{"v":424.72216085666406,"d":"424.7"},{"v":0.44355720521112524,"d":"0.4"},{"v":316.484101334841,"d":"316.5"},{"v":1341.33377291556,"d":"1341.3"},{"v":0.9435498116476976,"d":"94%"},{"v":445.11307600113076,"d":"445.1"},{"v":1086.1638240285902,"d":"1,086.2"},{"v":1341.3322417009651,"d":"1,341.3"},"EMERGING 2","GLORIA 0.6 com"]
{"$rows_left_out":25}
{"sheet":"Data Sources' Details","index":11,"n_rows":19,"n_cols":12,"rows_kept":19,"merged":[[2,0,3,0],[2,1,3,1],[2,2,3,2],[2,3,3,3],[2,4,3,4],[2,5,3,5],[2,6,3,6],[2,7,3,7],[2,9,3,9],[2,10,3,10],[2,11,3,11],[4,0,5,0],[4,2,5,2],[4,3,5,3],[4,5,5,5],[4,6,5,6],[4,9,5,9],[4,10,5,10],[4,11,5,11],[9,0,10,0],[9,2,10,2],[9,3,10,3],[9,4,10,4],[9,5,10,5],[9,6,10,6],[9,7,10,7],[9,8,10,8],[9,9,10,9],[9,10,10,10],[9,11,10,11],[13,0,14,0],[13,2,14,2],[13,3,14,3],[13,4,14,4],[13,5,14,5],[13,6,14,6],[13,7,14,7],[13,8,14,8],[13,9,14,9],[13,10,14,10],[13,11,14,11]]}
["Data source and publication year (or version)","Acronym","Available data years","Available regional detail","Carbon intensities analyzed","GHGs included","Electricity generation technologies","Handling co-products","Unit type","Database type","Reference","Prices"]
["EXIOBASE Hybrid SUT v3.3.18","EXIO Hybrid",2011,"AT, BE, BG, CY, CZ, DE, DK, EE, ES, FI, FR, GR, HR, HU, IE, IT, LT, LU, LV, MT, NL, PL, PT, RO, SE, SI, SK, GB, US, JP, CN, CA, KR, BR, IN, MX, RU, AU, CH, TR, NO, ID, ZA, RoW Asia and Pacific, RoW America, RoW Europe, RoW Africa, RoW Middle East","Direct CI, Life-Cycle CI","CO2, N2O, CH4, SF6, HFCs","Production of electricity by coal, Production of electricity by biomass and waste, Production of electricity by Geothermal, Production of electricity by hydro, Production of electricity by gas, Production of electricity nec, Production of electricity by nuclear, Production of electricity by petroleum and other oil derivatives, Production of electricity by solar photovoltaic; Production of electricity by solar thermal, Production of electricity by tide, wave, ocean, Production of electricity by wind","Industry-based","Physical","EEIOT","(Stadler et al., 2021a)","NA"]
["Ecoinvent v3.4 via Steubing et al. ","Ecoinvent",null,"216 regions (sub-regions, nations, clusters), but geographical information removed for this study for licenced data (following Steubing et al., 2022)","Life-Cycle CI","CO2, N2O, CH4, SF6, HFCs","Coal, Biomass, Waste, Geothermal, Hydroelectric, Natural Gas, Industrial gasses, Nuclear, Petroleum products, Photovoltaics, Wind","Cut-off ",null,"P-LCA","(“Ecoinvent,” 2025; Steubing et al., 2022)","NA"]
[{"$nulls":8},"Physical"]
["IEA emission factors per plant 2024","IEA (CHP)","1990-2023","AL, DZ, AO, AR, AM, AU, AT, AZ, BH, BD, BY, BE, BJ, BO, BA, BW, BR, BN, BG, KH, CM, CA, CL, CN, CO, CG, CD, CR, CI, HR, CU, CW, CY, CZ, DK, DO, EC, EG, SV, GQ, ER, EE, ET, SZ, FI, FR, GA, GE, DE, GH, GI, GR, GT, GY, HT, HN, HK, HU, IS, IN, ID, IR, IQ, IE, IL, IT, JM, JP, JO, KZ, KE, KR, KP, XK, KW, KG, LA, LV, LB, LY, LT, LU, MG, MY, MT, MU, MX, MD, MN, ME, MA, MZ, MM, NA, NP, NL, NZ, NI, NE, NG, MK, NO, OM, PK, PA, PY, PE, PH, PL, PT, QA, RO, RU, RW, SA, SN, RS, SG, SK, SI, ZA, ES, LK, SS, SD, SR, SE, CH, SY, TW, TJ, TZ, TH, TG, TT, TN, TR, TM, AE, UG, GB, UA, UY, US, UZ, VE, VN, YE, ZM, ZW, World, OECD Total, OECD Americas, OECD Asia Oceania, OECD Europe, Africa, Non-OECD Americas, Middle East, Non-OECD Europe and Eurasia, Non-OECD Asia (excluding China), China (PR of China and Hong Kong China) ","Life-Cycle CI","CO2, N2O, CH4","Coal peat and oil shale, Non-renewable wastes, Natural gas, Oil","Electricity and heat CHP/","Physical","Primary data","(IEA, 2024b)","NA"]
[null,"IEA (ele)",{"$nulls":5},"Electricity output only"]
{"$rows_left_out":13}