{"text_format":"3","workbook":"xlsx","n_sheets":12,"sheets":["CoverSheet","DCI by technology","Stat analysis DCI by tech","LCCI by technology","Stat analysis LCCI by tech","DCI by country","LCCI by country","Stat analysis DCI 2017","Stat analysis DCI 2023","Stat analysis LCCI 2017","Stat analysis LCCI 2023","Data Sources' Details"],"not_rendered":{"images":3,"external_links":1,"defined_names":2},"read":"whole","date_system":"1900"}

{"sheet":"CoverSheet","index":0,"n_rows":23,"n_cols":1,"rows_kept":23,"merged":[[4,0,5,8],[8,0,9,7]]}
["Journal of Industrial Ecology – www.wileyonlinelibrary.com/journal/jie"]
[]
["           SUPPORTING INFORMATION FOR:"]
[]
["Citterio, C., Golinucci, N., Rinaldi, L. & Rocco, M. V. Carbon footprint of electricity: a systematic methodological and quantitative review. Journal of Industrial Ecology. "]
[]
[]
[]
["This supporting information provides the values of carbon intensity by technology from the considered sources, and results of computations to obtain factors for country electricity generation. Summaries of statistical analysis are reported for each intensity indicator. \"Data sources's details\" extends Table 1 of the article."]
[]
[]
["Sheets summary"]
["Direct Carbon Intensity by technology"]
["Statistic analysis DCI by technology"]
["Life Cycle Carbon Intensity by technology"]
["Statistic analysis LCCI by technology"]
["DCI by country 2017&2023"]
["LCCI by country 2017&2023"]
["Statistic analyisis national DCI 2017"]
["Statistic analyisis national DCI 2023"]
["Statistic analyisis national LCCI 2017"]
["Statistic analyisis national LCCI 2023"]
["Data sources' details"]

{"sheet":"DCI by technology","index":1,"n_rows":478,"n_cols":8,"rows_kept":478}
["Source","Technology_aggr","Technology","Country","GWP100","Unit","Notes","Data from figure 1a in manuscript"]
["Electricity Maps","Natural Gas","NG","AT",380,"g/kWh","EU-ETS, ENTSO-E 2023"]
["Electricity Maps","Natural Gas","NG","CZ",364.25,"g/kWh","EU-ETS, ENTSO-E 2023"]
["Electricity Maps","Natural Gas","NG","US",406.03429619999997,"g/kWh","eGrid 2020"]
["Electricity Maps","Natural Gas","NG","NL",404.39,"g/kWh","EU-ETS, ENTSO-E 2023"]
["Electricity Maps","Natural Gas","NG","IE",473.89,"g/kWh","EU-ETS, ENTSO-E 2023"]
["Electricity Maps","Natural Gas","NG","BG",410.39,"g/kWh","EU-ETS, ENTSO-E 2023"]
["Electricity Maps","Natural Gas","NG","CY",410.39,"g/kWh","EU-ETS, ENTSO-E 2023"]
["Electricity Maps","Natural Gas","NG","EE",410.39,"g/kWh","EU-ETS, ENTSO-E 2023"]
["Electricity Maps","Natural Gas","NG","HR",410.39,"g/kWh","EU-ETS, ENTSO-E 2023"]
["Electricity Maps","Natural Gas","NG","LU",410.39,"g/kWh","EU-ETS, ENTSO-E 2023"]
["Electricity Maps","Natural Gas","NG","MT",410.39,"g/kWh","EU-ETS, ENTSO-E 2023"]
["Electricity Maps","Natural Gas","NG","SI",410.39,"g/kWh","EU-ETS, ENTSO-E 2023"]
["Electricity Maps","Natural Gas","NG","EL",396.14,"g/kWh","EU-ETS, ENTSO-E 2023"]
["Electricity Maps","Natural Gas","NG","BE",393.56,"g/kWh","EU-ETS, ENTSO-E 2023"]
["Electricity Maps","Natural Gas","NG","PT",375.95,"g/kWh","EU-ETS, ENTSO-E 2023"]
["Electricity Maps","Natural Gas","NG","SE",312.59,"g/kWh","EU-ETS, ENTSO-E 2023"]
["Electricity Maps","Natural Gas","NG","IT",415.98,"g/kWh","EU-ETS, ENTSO-E 2023"]
["Electricity Maps","Natural Gas","NG","DE",409.62,"g/kWh","EU-ETS, ENTSO-E 2023"]
["Electricity Maps","Natural Gas","NG","DK",299.26,"g/kWh","EU-ETS, ENTSO-E 2023"]
["Electricity Maps","Natural Gas","NG","SK",514.8,"g/kWh","EU-ETS, ENTSO-E 2023"]
["Electricity Maps","Natural Gas","NG","FR",391.79,"g/kWh","EU-ETS, ENTSO-E 2023"]
["Electricity Maps","Natural Gas","NG","ES",399.79,"g/kWh","EU-ETS, ENTSO-E 2023"]
["Electricity Maps","Natural Gas","NG","LV",371.24,"g/kWh","EU-ETS, ENTSO-E 2023"]
["Electricity Maps","Natural Gas","NG","HU",441.99,"g/kWh","EU-ETS, ENTSO-E 2023"]
["Electricity Maps","Natural Gas","NG","RO",567.48,"g/kWh","EU-ETS, ENTSO-E 2023"]
["Electricity Maps","Natural Gas","NG","LT",375.63,"g/kWh","EU-ETS, ENTSO-E 2023"]
["Electricity Maps","Natural Gas","NG","PL",408.97,"g/kWh","EU-ETS, ENTSO-E 2023"]
["Electricity Maps","Natural Gas","NG","FI",476.61,"g/kWh","EU-ETS, ENTSO-E 2023"]
["Electricity Maps","Oil","OI","FR",657.06,"g/kWh","EU-ETS, ENTSO-E 2023"]
["Electricity Maps","Oil","OI","AT",641.08,"g/kWh","EU-ETS, ENTSO-E 2023"]
["Electricity Maps","Oil","OI","BE",641.08,"g/kWh","EU-ETS, ENTSO-E 2023"]
["Electricity Maps","Oil","OI","CY",641.08,"g/kWh","EU-ETS, ENTSO-E 2023"]
["Electricity Maps","Oil","OI","DE",641.08,"g/kWh","EU-ETS, ENTSO-E 2023"]
["Electricity Maps","Oil","OI","DK",641.08,"g/kWh","EU-ETS, ENTSO-E 2023"]
["Electricity Maps","Oil","OI","EE",641.08,"g/kWh","EU-ETS, ENTSO-E 2023"]
["Electricity Maps","Oil","OI","ES",641.08,"g/kWh","EU-ETS, ENTSO-E 2023"]
["Electricity Maps","Oil","OI","FI",641.08,"g/kWh","EU-ETS, ENTSO-E 2023"]
["Electricity Maps","Oil","OI","HR",641.08,"g/kWh","EU-ETS, ENTSO-E 2023"]
["Electricity Maps","Oil","OI","HU",641.08,"g/kWh","EU-ETS, ENTSO-E 2023"]
["Electricity Maps","Oil","OI","IE",641.08,"g/kWh","EU-ETS, ENTSO-E 2023"]
["Electricity Maps","Oil","OI","LV",641.08,"g/kWh","EU-ETS, ENTSO-E 2023"]
["Electricity Maps","Oil","OI","MT",641.08,"g/kWh","EU-ETS, ENTSO-E 2023"]
["Electricity Maps","Oil","OI","PL",641.08,"g/kWh","EU-ETS, ENTSO-E 2023"]
["Electricity Maps","Oil","OI","RO",641.08,"g/kWh","EU-ETS, ENTSO-E 2023"]
["Electricity Maps","Oil","OI","SI",641.08,"g/kWh","EU-ETS, ENTSO-E 2023"]
["Electricity Maps","Oil","OI","SK",641.08,"g/kWh","EU-ETS, ENTSO-E 2023"]
["Electricity Maps","Oil","OI","US",803.8986689,"g/kWh","eGrid 2020"]
["Electricity Maps","Oil","OI","BG",925.95,"g/kWh","EU-ETS, ENTSO-E 2022"]
["Electricity Maps","Oil","OI","CZ",925.95,"g/kWh","EU-ETS, ENTSO-E 2022"]
["Electricity Maps","Oil","OI","EL",925.95,"g/kWh","EU-ETS, ENTSO-E 2022"]
["Electricity Maps","Oil","OI","LT",925.95,"g/kWh","EU-ETS, ENTSO-E 2022"]
["Electricity Maps","Oil","OI","LU",925.95,"g/kWh","EU-ETS, ENTSO-E 2022"]
["Electricity Maps","Oil","OI","NL",925.95,"g/kWh","EU-ETS, ENTSO-E 2022"]
["Electricity Maps","Oil","OI","PT",925.95,"g/kWh","EU-ETS, ENTSO-E 2022"]
["Electricity Maps","Oil","OI","SE",373.49,"g/kWh","EU-ETS, ENTSO-E 2023"]
["Electricity Maps","Oil","OI","IT",860.73,"g/kWh","EU-ETS, ENTSO-E 2023"]
["Electricity Maps","Coal","CO","AT",1075.5,"g/kWh","EU-ETS, ENTSO-E 2022"]
["Electricity Maps","Coal","CO","LU",1075.5,"g/kWh","EU-ETS, ENTSO-E 2022"]
["Electricity Maps","Coal","CO","PT",1075.5,"g/kWh","EU-ETS, ENTSO-E 2022"]
["Electricity Maps","Coal","CO","SE",1075.5,"g/kWh","EU-ETS, ENTSO-E 2022"]
["Electricity Maps","Coal","CO","BE",1037.31,"g/kWh","EU-ETS, ENTSO-E 2023"]
["Electricity Maps","Coal","CO","CY",1037.31,"g/kWh","EU-ETS, ENTSO-E 2023"]
["Electricity Maps","Coal","CO","EE",1037.31,"g/kWh","EU-ETS, ENTSO-E 2023"]
["Electricity Maps","Coal","CO","HR",1037.31,"g/kWh","EU-ETS, ENTSO-E 2023"]
["Electricity Maps","Coal","CO","LT",1037.31,"g/kWh","EU-ETS, ENTSO-E 2023"]
["Electricity Maps","Coal","CO","LV",1037.31,"g/kWh","EU-ETS, ENTSO-E 2023"]
["Electricity Maps","Coal","CO","MT",1037.31,"g/kWh","EU-ETS, ENTSO-E 2023"]
["Electricity Maps","Coal","CO","SI",1037.31,"g/kWh","EU-ETS, ENTSO-E 2023"]
["Electricity Maps","Coal","CO","IT",1001.28,"g/kWh","EU-ETS, ENTSO-E 2023"]
["Electricity Maps","Coal","CO","CZ",1051.99,"g/kWh","EU-ETS, ENTSO-E 2023"]
["Electricity Maps","Coal","CO","NL",799.37,"g/kWh","EU-ETS, ENTSO-E 2023"]
["Electricity Maps","Coal","CO","SK",764.9,"g/kWh","EU-ETS, ENTSO-E 2023"]
["Electricity Maps","Coal","CO","ES",1221.36,"g/kWh","EU-ETS, ENTSO-E 2023"]
["Electricity Maps","Coal","CO","BG",1123.53,"g/kWh","EU-ETS, ENTSO-E 2023"]
["Electricity Maps","Coal","CO","EL",1218.46,"g/kWh","EU-ETS, ENTSO-E 2023"]
["Electricity Maps","Coal","CO","US",989.615358,"g/kWh","eGrid 2020"]
["Electricity Maps","Coal","CO","DK",720.51,"g/kWh","EU-ETS, ENTSO-E 2023"]
["Electricity Maps","Coal","CO","FR",923.04,"g/kWh","EU-ETS, ENTSO-E 2023"]
["Electricity Maps","Coal","CO","FI",718.07,"g/kWh","EU-ETS, ENTSO-E 2023"]
["Electricity Maps","Coal","CO","IE",1201.64,"g/kWh","EU-ETS, ENTSO-E 2023"]
["Electricity Maps","Coal","CO","HU",1231.95,"g/kWh","EU-ETS, ENTSO-E 2023"]
["Electricity Maps","Coal","CO","RO",1224.26,"g/kWh","EU-ETS, ENTSO-E 2023"]
["Electricity Maps","Coal","CO","DE",1018.94,"g/kWh","EU-ETS, ENTSO-E 2023"]
["Electricity Maps","Coal","CO","PL",1078.88,"g/kWh","EU-ETS, ENTSO-E 2023"]
["Electricity Maps","Wind","WI","AT",0,"g/kWh","IPCC 2014"]
["Electricity Maps","Wind","WI","BE",0,"g/kWh","IPCC 2014"]
["Electricity Maps","Wind","WI","BG",0,"g/kWh","IPCC 2014"]
["Electricity Maps","Wind","WI","CY",0,"g/kWh","IPCC 2014"]
["Electricity Maps","Wind","WI","CZ",0,"g/kWh","IPCC 2014"]
["Electricity Maps","Wind","WI","DE",0,"g/kWh","IPCC 2014"]
["Electricity Maps","Wind","WI","DK",0,"g/kWh","IPCC 2014"]
["Electricity Maps","Wind","WI","EE",0,"g/kWh","IPCC 2014"]
["Electricity Maps","Wind","WI","ES",0,"g/kWh","IPCC 2014"]
["Electricity Maps","Wind","WI","FI",0,"g/kWh","IPCC 2014"]
["Electricity Maps","Wind","WI","FR",0,"g/kWh","IPCC 2014"]
["Electricity Maps","Wind","WI","EL",0,"g/kWh","IPCC 2014"]
["Electricity Maps","Wind","WI","HR",0,"g/kWh","IPCC 2014"]
["Electricity Maps","Wind","WI","HU",0,"g/kWh","IPCC 2014"]
["Electricity Maps","Wind","WI","IE",0,"g/kWh","IPCC 2014"]
["Electricity Maps","Wind","WI","IT",0,"g/kWh","IPCC 2014"]
["Electricity Maps","Wind","WI","LT",0,"g/kWh","IPCC 2014"]
["Electricity Maps","Wind","WI","LU",0,"g/kWh","IPCC 2014"]
["Electricity Maps","Wind","WI","LV",0,"g/kWh","IPCC 2014"]
["Electricity Maps","Wind","WI","MT",0,"g/kWh","IPCC 2014"]
["Electricity Maps","Wind","WI","NL",0,"g/kWh","IPCC 2014"]
["Electricity Maps","Wind","WI","PL",0,"g/kWh","IPCC 2014"]
["Electricity Maps","Wind","WI","PT",0,"g/kWh","IPCC 2014"]
["Electricity Maps","Wind","WI","RO",0,"g/kWh","IPCC 2014"]
["Electricity Maps","Wind","WI","SE",0,"g/kWh","IPCC 2014"]
["Electricity Maps","Wind","WI","SI",0,"g/kWh","IPCC 2014"]
["Electricity Maps","Wind","WI","SK",0,"g/kWh","IPCC 2014"]
["Electricity Maps","Wind","WI","US",0,"g/kWh","IPCC 2014"]
["Electricity Maps","Hydro","HY","AT",0,"g/kWh","IPCC 2014"]
["Electricity Maps","Hydro","HY","BE",0,"g/kWh","IPCC 2014"]
["Electricity Maps","Hydro","HY","BG",0,"g/kWh","IPCC 2014"]
["Electricity Maps","Hydro","HY","CY",0,"g/kWh","IPCC 2014"]
["Electricity Maps","Hydro","HY","CZ",0,"g/kWh","IPCC 2014"]
["Electricity Maps","Hydro","HY","DE",0,"g/kWh","IPCC 2014"]
["Electricity Maps","Hydro","HY","DK",0,"g/kWh","IPCC 2014"]
["Electricity Maps","Hydro","HY","EE",0,"g/kWh","IPCC 2014"]
["Electricity Maps","Hydro","HY","ES",0,"g/kWh","IPCC 2014"]
["Electricity Maps","Hydro","HY","FI",0,"g/kWh","IPCC 2014"]
["Electricity Maps","Hydro","HY","FR",0,"g/kWh","IPCC 2014"]
["Electricity Maps","Hydro","HY","EL",0,"g/kWh","IPCC 2014"]
["Electricity Maps","Hydro","HY","HR",0,"g/kWh","IPCC 2014"]
["Electricity Maps","Hydro","HY","HU",0,"g/kWh","IPCC 2014"]
["Electricity Maps","Hydro","HY","IE",0,"g/kWh","IPCC 2014"]
["Electricity Maps","Hydro","HY","IT",0,"g/kWh","IPCC 2014"]
["Electricity Maps","Hydro","HY","LT",0,"g/kWh","IPCC 2014"]
["Electricity Maps","Hydro","HY","LU",0,"g/kWh","IPCC 2014"]
["Electricity Maps","Hydro","HY","LV",0,"g/kWh","IPCC 2014"]
["Electricity Maps","Hydro","HY","MT",0,"g/kWh","IPCC 2014"]
["Electricity Maps","Hydro","HY","NL",0,"g/kWh","IPCC 2014"]
["Electricity Maps","Hydro","HY","PL",0,"g/kWh","IPCC 2014"]
["Electricity Maps","Hydro","HY","PT",0,"g/kWh","IPCC 2014"]
["Electricity Maps","Hydro","HY","RO",0,"g/kWh","IPCC 2014"]
["Electricity Maps","Hydro","HY","SE",0,"g/kWh","IPCC 2014"]
["Electricity Maps","Hydro","HY","SI",0,"g/kWh","IPCC 2014"]
["Electricity Maps","Hydro","HY","SK",0,"g/kWh","IPCC 2014"]
["Electricity Maps","Hydro","HY","US",0,"g/kWh","IPCC 2014"]
["Electricity Maps","Solar","SO","AT",0,"g/kWh","IPCC 2014"]
["Electricity Maps","Solar","SO","BE",0,"g/kWh","IPCC 2014"]
["Electricity Maps","Solar","SO","BG",0,"g/kWh","IPCC 2014"]
["Electricity Maps","Solar","SO","CY",0,"g/kWh","IPCC 2014"]
["Electricity Maps","Solar","SO","CZ",0,"g/kWh","IPCC 2014"]
["Electricity Maps","Solar","SO","DE",0,"g/kWh","IPCC 2014"]
["Electricity Maps","Solar","SO","DK",0,"g/kWh","IPCC 2014"]
["Electricity Maps","Solar","SO","EE",0,"g/kWh","IPCC 2014"]
["Electricity Maps","Solar","SO","ES",0,"g/kWh","IPCC 2014"]
["Electricity Maps","Solar","SO","FI",0,"g/kWh","IPCC 2014"]
["Electricity Maps","Solar","SO","FR",0,"g/kWh","IPCC 2014"]
["Electricity Maps","Solar","SO","EL",0,"g/kWh","IPCC 2014"]
["Electricity Maps","Solar","SO","HR",0,"g/kWh","IPCC 2014"]
["Electricity Maps","Solar","SO","HU",0,"g/kWh","IPCC 2014"]
["Electricity Maps","Solar","SO","IE",0,"g/kWh","IPCC 2014"]
["Electricity Maps","Solar","SO","IT",0,"g/kWh","IPCC 2014"]
["Electricity Maps","Solar","SO","LT",0,"g/kWh","IPCC 2014"]
["Electricity Maps","Solar","SO","LU",0,"g/kWh","IPCC 2014"]
["Electricity Maps","Solar","SO","LV",0,"g/kWh","IPCC 2014"]
["Electricity Maps","Solar","SO","MT",0,"g/kWh","IPCC 2014"]
["Electricity Maps","Solar","SO","NL",0,"g/kWh","IPCC 2014"]
["Electricity Maps","Solar","SO","PL",0,"g/kWh","IPCC 2014"]
["Electricity Maps","Solar","SO","PT",0,"g/kWh","IPCC 2014"]
["Electricity Maps","Solar","SO","RO",0,"g/kWh","IPCC 2014"]
["Electricity Maps","Solar","SO","SE",0,"g/kWh","IPCC 2014"]
["Electricity Maps","Solar","SO","SI",0,"g/kWh","IPCC 2014"]
["Electricity Maps","Solar","SO","SK",0,"g/kWh","IPCC 2014"]
["Electricity Maps","Solar","SO","US",0,"g/kWh","IPCC 2014"]
["Electricity Maps","Biomass and waste","BWB","AT",0,"g/kWh","BEIS 2021"]
["Electricity Maps","Biomass and waste","BWB","BE",0,"g/kWh","BEIS 2021"]
["Electricity Maps","Biomass and waste","BWB","BG",0,"g/kWh","BEIS 2021"]
["Electricity Maps","Biomass and waste","BWB","CY",0,"g/kWh","BEIS 2021"]
["Electricity Maps","Biomass and waste","BWB","CZ",0,"g/kWh","BEIS 2021"]
["Electricity Maps","Biomass and waste","BWB","DE",0,"g/kWh","BEIS 2021"]
["Electricity Maps","Biomass and waste","BWB","DK",0,"g/kWh","BEIS 2021"]
["Electricity Maps","Biomass and waste","BWB","EE",0,"g/kWh","BEIS 2021"]
["Electricity Maps","Biomass and waste","BWB","ES",0,"g/kWh","BEIS 2021"]
["Electricity Maps","Biomass and waste","BWB","FI",0,"g/kWh","BEIS 2021"]
["Electricity Maps","Biomass and waste","BWB","FR",0,"g/kWh","BEIS 2021"]
["Electricity Maps","Biomass and waste","BWB","EL",0,"g/kWh","BEIS 2021"]
["Electricity Maps","Biomass and waste","BWB","HR",0,"g/kWh","BEIS 2021"]
["Electricity Maps","Biomass and waste","BWB","HU",0,"g/kWh","BEIS 2021"]
["Electricity Maps","Biomass and waste","BWB","IE",0,"g/kWh","BEIS 2021"]
["Electricity Maps","Biomass and waste","BWB","IT",0,"g/kWh","BEIS 2021"]
["Electricity Maps","Biomass and waste","BWB","LT",0,"g/kWh","BEIS 2021"]
["Electricity Maps","Biomass and waste","BWB","LU",0,"g/kWh","BEIS 2021"]
["Electricity Maps","Biomass and waste","BWB","LV",0,"g/kWh","BEIS 2021"]
["Electricity Maps","Biomass and waste","BWB","MT",0,"g/kWh","BEIS 2021"]
["Electricity Maps","Biomass and waste","BWB","NL",0,"g/kWh","EU-ETS 2021"]
["Electricity Maps","Biomass and waste","BWB","PL",0,"g/kWh","BEIS 2021"]
["Electricity Maps","Biomass and waste","BWB","PT",0,"g/kWh","BEIS 2021"]
["Electricity Maps","Biomass and waste","BWB","RO",0,"g/kWh","BEIS 2021"]
["Electricity Maps","Biomass and waste","BWB","SE",0,"g/kWh","BEIS 2021"]
["Electricity Maps","Biomass and waste","BWB","SI",0,"g/kWh","BEIS 2021"]
["Electricity Maps","Biomass and waste","BWB","SK",0,"g/kWh","BEIS 2021"]
["Electricity Maps","Biomass and waste","BWB","US",0,"g/kWh","eGrid 2020"]
["Electricity Maps","Nuclear","NU","AT",0,"g/kWh","IPCC 2014"]
["Electricity Maps","Nuclear","NU","BE",0,"g/kWh","IPCC 2014"]
["Electricity Maps","Nuclear","NU","BG",0,"g/kWh","IPCC 2014"]
["Electricity Maps","Nuclear","NU","CY",0,"g/kWh","IPCC 2014"]
["Electricity Maps","Nuclear","NU","CZ",0,"g/kWh","IPCC 2014"]
["Electricity Maps","Nuclear","NU","DE",0,"g/kWh","IPCC 2014"]
["Electricity Maps","Nuclear","NU","DK",0,"g/kWh","IPCC 2014"]
["Electricity Maps","Nuclear","NU","EE",0,"g/kWh","IPCC 2014"]
["Electricity Maps","Nuclear","NU","ES",0,"g/kWh","IPCC 2014"]
["Electricity Maps","Nuclear","NU","FI",0,"g/kWh","IPCC 2014"]
["Electricity Maps","Nuclear","NU","FR",0,"g/kWh","IPCC 2014"]
["Electricity Maps","Nuclear","NU","EL",0,"g/kWh","IPCC 2014"]
["Electricity Maps","Nuclear","NU","HR",0,"g/kWh","IPCC 2014"]
["Electricity Maps","Nuclear","NU","HU",0,"g/kWh","IPCC 2014"]
["Electricity Maps","Nuclear","NU","IE",0,"g/kWh","IPCC 2014"]
["Electricity Maps","Nuclear","NU","IT",0,"g/kWh","IPCC 2014"]
["Electricity Maps","Nuclear","NU","LT",0,"g/kWh","IPCC 2014"]
["Electricity Maps","Nuclear","NU","LU",0,"g/kWh","IPCC 2014"]
["Electricity Maps","Nuclear","NU","LV",0,"g/kWh","IPCC 2014"]
["Electricity Maps","Nuclear","NU","MT",0,"g/kWh","IPCC 2014"]
["Electricity Maps","Nuclear","NU","NL",0,"g/kWh","IPCC 2014"]
["Electricity Maps","Nuclear","NU","PL",0,"g/kWh","IPCC 2014"]
["Electricity Maps","Nuclear","NU","PT",0,"g/kWh","IPCC 2014"]
["Electricity Maps","Nuclear","NU","RO",0,"g/kWh","IPCC 2014"]
["Electricity Maps","Nuclear","NU","SE",0,"g/kWh","IPCC 2014"]
["Electricity Maps","Nuclear","NU","SI",0,"g/kWh","IPCC 2014"]
["Electricity Maps","Nuclear","NU","SK",0,"g/kWh","IPCC 2014"]
["Electricity Maps","Nuclear","NU","US",0,"g/kWh","IPCC 2014"]
["Electricity Maps","Nec","NC","AT",575,"g/kWh","assumes thermal (coal, gas, or oil)"]
["Electricity Maps","Nec","NC","BE",575,"g/kWh","assumes thermal (coal, gas, or oil)"]
["Electricity Maps","Nec","NC","BG",575,"g/kWh","assumes thermal (coal, gas, or oil)"]
["Electricity Maps","Nec","NC","CY",575,"g/kWh","assumes thermal (coal, gas, or oil)"]
["Electricity Maps","Nec","NC","CZ",575,"g/kWh","assumes thermal (coal, gas, or oil)"]
["Electricity Maps","Nec","NC","DE",575,"g/kWh","assumes thermal (coal, gas, or oil)"]
["Electricity Maps","Nec","NC","DK",575,"g/kWh","assumes thermal (coal, gas, or oil)"]
["Electricity Maps","Nec","NC","EE",575,"g/kWh","assumes thermal (coal, gas, or oil)"]
["Electricity Maps","Nec","NC","ES",575,"g/kWh","assumes thermal (coal, gas, or oil)"]
["Electricity Maps","Nec","NC","FI",575,"g/kWh","assumes thermal (coal, gas, or oil)"]
["Electricity Maps","Nec","NC","FR",575,"g/kWh","assumes thermal (coal, gas, or oil)"]
["Electricity Maps","Nec","NC","EL",575,"g/kWh","assumes thermal (coal, gas, or oil)"]
["Electricity Maps","Nec","NC","HR",575,"g/kWh","assumes thermal (coal, gas, or oil)"]
["Electricity Maps","Nec","NC","HU",575,"g/kWh","assumes thermal (coal, gas, or oil)"]
["Electricity Maps","Nec","NC","IE",575,"g/kWh","assumes thermal (coal, gas, or oil)"]
["Electricity Maps","Nec","NC","IT",575,"g/kWh","assumes thermal (coal, gas, or oil)"]
["Electricity Maps","Nec","NC","LT",575,"g/kWh","assumes thermal (coal, gas, or oil)"]
["Electricity Maps","Nec","NC","LU",575,"g/kWh","assumes thermal (coal, gas, or oil)"]
["Electricity Maps","Nec","NC","LV",575,"g/kWh","assumes thermal (coal, gas, or oil)"]
["Electricity Maps","Nec","NC","MT",575,"g/kWh","assumes thermal (coal, gas, or oil)"]
["Electricity Maps","Nec","NC","NL",575,"g/kWh","assumes thermal (coal, gas, or oil)"]
["Electricity Maps","Nec","NC","PL",575,"g/kWh","assumes thermal (coal, gas, or oil)"]
["Electricity Maps","Nec","NC","PT",575,"g/kWh","assumes thermal (coal, gas, or oil)"]
["Electricity Maps","Nec","NC","RO",575,"g/kWh","assumes thermal (coal, gas, or oil)"]
["Electricity Maps","Nec","NC","SI",575,"g/kWh","assumes thermal (coal, gas, or oil)"]
["Electricity Maps","Nec","NC","SK",575,"g/kWh","assumes thermal (coal, gas, or oil)"]
["Electricity Maps","Nec","NC","US",575,"g/kWh","assumes thermal (coal, gas, or oil)"]
["Electricity Maps","Nec","NC","SE",28.6,"g/kWh","Eurostat 2022; assumes 98.26% biomass, 1.09% oil, 0.64% peat, 0.01% coal"]
["Electricity Maps","Geothermal","GE","AT",0,"g/kWh","IPCC 2014"]
["Electricity Maps","Geothermal","GE","BE",0,"g/kWh","IPCC 2014"]
["Electricity Maps","Geothermal","GE","BG",0,"g/kWh","IPCC 2014"]
["Electricity Maps","Geothermal","GE","CY",0,"g/kWh","IPCC 2014"]
["Electricity Maps","Geothermal","GE","CZ",0,"g/kWh","IPCC 2014"]
["Electricity Maps","Geothermal","GE","DE",0,"g/kWh","IPCC 2014"]
["Electricity Maps","Geothermal","GE","DK",0,"g/kWh","IPCC 2014"]
["Electricity Maps","Geothermal","GE","EE",0,"g/kWh","IPCC 2014"]
["Electricity Maps","Geothermal","GE","ES",0,"g/kWh","IPCC 2014"]
["Electricity Maps","Geothermal","GE","FI",0,"g/kWh","IPCC 2014"]
["Electricity Maps","Geothermal","GE","FR",0,"g/kWh","IPCC 2014"]
["Electricity Maps","Geothermal","GE","EL",0,"g/kWh","IPCC 2014"]
["Electricity Maps","Geothermal","GE","HR",0,"g/kWh","IPCC 2014"]
["Electricity Maps","Geothermal","GE","HU",0,"g/kWh","IPCC 2014"]
["Electricity Maps","Geothermal","GE","IE",0,"g/kWh","IPCC 2014"]
["Electricity Maps","Geothermal","GE","IT",0,"g/kWh","IPCC 2014"]
["Electricity Maps","Geothermal","GE","LT",0,"g/kWh","IPCC 2014"]
["Electricity Maps","Geothermal","GE","LU",0,"g/kWh","IPCC 2014"]
["Electricity Maps","Geothermal","GE","LV",0,"g/kWh","IPCC 2014"]
["Electricity Maps","Geothermal","GE","MT",0,"g/kWh","IPCC 2014"]
["Electricity Maps","Geothermal","GE","NL",0,"g/kWh","IPCC 2014"]
["Electricity Maps","Geothermal","GE","PL",0,"g/kWh","IPCC 2014"]
["Electricity Maps","Geothermal","GE","PT",0,"g/kWh","IPCC 2014"]
["Electricity Maps","Geothermal","GE","RO",0,"g/kWh","IPCC 2014"]
["Electricity Maps","Geothermal","GE","SE",0,"g/kWh","IPCC 2014"]
["Electricity Maps","Geothermal","GE","SI",0,"g/kWh","IPCC 2014"]
["Electricity Maps","Geothermal","GE","SK",0,"g/kWh","IPCC 2014"]
["Electricity Maps","Geothermal","GE","US",70.87985131,"g/kWh","eGrid 2020"]
["EXIO Hybrid","Biomass and waste","BW","AT",9.823292507829933,"g/kWh","activity"]
["EXIO Hybrid","Biomass and waste","BW","BE",4.896389995277715,"g/kWh","activity"]
["EXIO Hybrid","Biomass and waste","BW","CZ",14.55253548625873,"g/kWh","activity"]
["EXIO Hybrid","Biomass and waste","BW","DE",0.5981668219307329,"g/kWh","activity"]
["EXIO Hybrid","Biomass and waste","BW","DK",5.633399354756934,"g/kWh","activity"]
["EXIO Hybrid","Biomass and waste","BW","EE",1.449655720151626,"g/kWh","activity"]
["EXIO Hybrid","Biomass and waste","BW","ES",14.10075852866135,"g/kWh","activity"]
["EXIO Hybrid","Biomass and waste","BW","FI",0.8779874372814555,"g/kWh","activity"]
["EXIO Hybrid","Biomass and waste","BW","FR",15.40306635743792,"g/kWh","activity"]
["EXIO Hybrid","Biomass and waste","BW","HR",17.78695980632301,"g/kWh","activity"]
["EXIO Hybrid","Biomass and waste","BW","HU",11.93090113860441,"g/kWh","activity"]
["EXIO Hybrid","Biomass and waste","BW","IE",3.435021835870517,"g/kWh","activity"]
["EXIO Hybrid","Biomass and waste","BW","IT",9.196170495504454,"g/kWh","activity"]
["EXIO Hybrid","Biomass and waste","BW","LT",15.61948168840275,"g/kWh","activity"]
["EXIO Hybrid","Biomass and waste","BW","LV",9.039684727388593,"g/kWh","activity"]
["EXIO Hybrid","Biomass and waste","BW","NL",1.94123296133104,"g/kWh","activity"]
["EXIO Hybrid","Biomass and waste","BW","PL",7.702845454693121,"g/kWh","activity"]
["EXIO Hybrid","Biomass and waste","BW","PT",0.7318317867653882,"g/kWh","activity"]
["EXIO Hybrid","Biomass and waste","BW","RO",7.358065959431893,"g/kWh","activity"]
["EXIO Hybrid","Biomass and waste","BW","SE",2.665385597901371,"g/kWh","activity"]
["EXIO Hybrid","Biomass and waste","BW","SI",0.6973492051704411,"g/kWh","activity"]
["EXIO Hybrid","Biomass and waste","BW","SK",5.837280790176194,"g/kWh","activity"]
["EXIO Hybrid","Biomass and waste","BW","US",6.107401040836938,"g/kWh","activity"]
["EXIO Hybrid","Coal","CO","AT",927.1231680736779,"g/kWh","activity"]
["EXIO Hybrid","Coal","CO","BE",904.7865804196827,"g/kWh","activity"]
["EXIO Hybrid","Coal","CO","BG",1105.086223883089,"g/kWh","activity"]
["EXIO Hybrid","Coal","CO","CZ",1039.407616058118,"g/kWh","activity"]
["EXIO Hybrid","Coal","CO","DE",908.6596880290497,"g/kWh","activity"]
["EXIO Hybrid","Coal","CO","DK",931.236505741198,"g/kWh","activity"]
["EXIO Hybrid","Coal","CO","EE",1204.071341521711,"g/kWh","activity"]
["EXIO Hybrid","Coal","CO","EL",1066.354345537385,"g/kWh","activity"]
["EXIO Hybrid","Coal","CO","ES",921.3112395782279,"g/kWh","activity"]
["EXIO Hybrid","Coal","CO","FI",966.7736961782832,"g/kWh","activity"]
["EXIO Hybrid","Coal","CO","FR",791.4345589797186,"g/kWh","activity"]
["EXIO Hybrid","Coal","CO","HR",861.2158944310886,"g/kWh","activity"]
["EXIO Hybrid","Coal","CO","HU",1050.269764767839,"g/kWh","activity"]
["EXIO Hybrid","Coal","CO","IE",824.208532907156,"g/kWh","activity"]
["EXIO Hybrid","Coal","CO","IT",887.3693680736932,"g/kWh","activity"]
["EXIO Hybrid","Coal","CO","NL",720.7722904534414,"g/kWh","activity"]
["EXIO Hybrid","Coal","CO","PL",878.0218376085022,"g/kWh","activity"]
["EXIO Hybrid","Coal","CO","PT",892.2871925678589,"g/kWh","activity"]
["EXIO Hybrid","Coal","CO","RO",1050.502715577829,"g/kWh","activity"]
["EXIO Hybrid","Coal","CO","SE",942.516425787589,"g/kWh","activity"]
["EXIO Hybrid","Coal","CO","SI",981.8804962248511,"g/kWh","activity"]
["EXIO Hybrid","Coal","CO","SK",1014.867135803901,"g/kWh","activity"]
["EXIO Hybrid","Coal","CO","US",927.3420213983467,"g/kWh","activity"]
["EXIO Hybrid","Geothermal","GE","AT",0.1064527232891373,"g/kWh","activity"]
["EXIO Hybrid","Geothermal","GE","IT",0.08518706382476153,"g/kWh","activity"]
["EXIO Hybrid","Geothermal","GE","PT",0.2387065551690467,"g/kWh","activity"]
["EXIO Hybrid","Geothermal","GE","US",0.3228261264183149,"g/kWh","activity"]
["EXIO Hybrid","Hydro","HY","AT",0.05762581137816501,"g/kWh","activity"]
["EXIO Hybrid","Hydro","HY","BE",0.08555174242396972,"g/kWh","activity"]
["EXIO Hybrid","Hydro","HY","BG",0.2784521417773861,"g/kWh","activity"]
["EXIO Hybrid","Hydro","HY","CZ",0.0978405197185714,"g/kWh","activity"]
["EXIO Hybrid","Hydro","HY","DE",0.04518066465752369,"g/kWh","activity"]
["EXIO Hybrid","Hydro","HY","DK",0.2394310778401784,"g/kWh","activity"]
["EXIO Hybrid","Hydro","HY","EE",0.169104768493931,"g/kWh","activity"]
["EXIO Hybrid","Hydro","HY","EL",0.141030551786829,"g/kWh","activity"]
["EXIO Hybrid","Hydro","HY","ES",0.1114411307401726,"g/kWh","activity"]
["EXIO Hybrid","Hydro","HY","FI",0.142571667222797,"g/kWh","activity"]
["EXIO Hybrid","Hydro","HY","FR",0.04977830553761479,"g/kWh","activity"]
["EXIO Hybrid","Hydro","HY","HR",0.04654102175262933,"g/kWh","activity"]
["EXIO Hybrid","Hydro","HY","HU",0.5036707208268737,"g/kWh","activity"]
["EXIO Hybrid","Hydro","HY","IE",0.4048706644604459,"g/kWh","activity"]
["EXIO Hybrid","Hydro","HY","IT",0.06210745540629584,"g/kWh","activity"]
["EXIO Hybrid","Hydro","HY","LT",0.7628862355445197,"g/kWh","activity"]
["EXIO Hybrid","Hydro","HY","LU",0.5300407835700516,"g/kWh","activity"]
["EXIO Hybrid","Hydro","HY","LV",1.018462006029211,"g/kWh","activity"]
["EXIO Hybrid","Hydro","HY","NL",0.4200414199829146,"g/kWh","activity"]
["EXIO Hybrid","Hydro","HY","PL",0.4714303162837168,"g/kWh","activity"]
["EXIO Hybrid","Hydro","HY","PT",0.2181948039110788,"g/kWh","activity"]
["EXIO Hybrid","Hydro","HY","RO",1.00861521533884,"g/kWh","activity"]
["EXIO Hybrid","Hydro","HY","SE",0.01899359767207669,"g/kWh","activity"]
["EXIO Hybrid","Hydro","HY","SI",0.08087753688297533,"g/kWh","activity"]
["EXIO Hybrid","Hydro","HY","SK",0.3704188545786185,"g/kWh","activity"]
["EXIO Hybrid","Hydro","HY","US",0.2666246356318572,"g/kWh","activity"]
["EXIO Hybrid","Nec","NC","AT",6.513683485096538,"g/kWh","activity"]
["EXIO Hybrid","Nec","NC","BE",0.5949281833307021,"g/kWh","activity"]
["EXIO Hybrid","Nec","NC","BG",13.33664564700238,"g/kWh","activity"]
["EXIO Hybrid","Nec","NC","FI",0.391801716070954,"g/kWh","activity"]
["EXIO Hybrid","Nec","NC","LT",7.6572954530394343E-7,"g/kWh","activity"]
["EXIO Hybrid","Nec","NC","NL",6.284555115678964,"g/kWh","activity"]
["EXIO Hybrid","Natural Gas","NG","AT",794.7117352550245,"g/kWh","activity"]
["EXIO Hybrid","Natural Gas","NG","BE",690.0545299658124,"g/kWh","activity"]
["EXIO Hybrid","Natural Gas","NG","BG",537.6340407191401,"g/kWh","activity"]
["EXIO Hybrid","Natural Gas","NG","CZ",642.3366509628722,"g/kWh","activity"]
["EXIO Hybrid","Natural Gas","NG","DE",757.1215241069344,"g/kWh","activity"]
["EXIO Hybrid","Natural Gas","NG","DK",540.3181363892487,"g/kWh","activity"]
["EXIO Hybrid","Natural Gas","NG","EE",676.3121439913346,"g/kWh","activity"]
["EXIO Hybrid","Natural Gas","NG","EL",537.3251510995617,"g/kWh","activity"]
["EXIO Hybrid","Natural Gas","NG","ES",559.262728655184,"g/kWh","activity"]
["EXIO Hybrid","Natural Gas","NG","FI",1457.41823181019,"g/kWh","activity"]
["EXIO Hybrid","Natural Gas","NG","FR",671.446502584347,"g/kWh","activity"]
["EXIO Hybrid","Natural Gas","NG","HR",648.384977545097,"g/kWh","activity"]
["EXIO Hybrid","Natural Gas","NG","HU",584.1083557647663,"g/kWh","activity"]
["EXIO Hybrid","Natural Gas","NG","IE",537.2953288044008,"g/kWh","activity"]
["EXIO Hybrid","Natural Gas","NG","IT",567.7684826768709,"g/kWh","activity"]
["EXIO Hybrid","Natural Gas","NG","LT",648.4086119001156,"g/kWh","activity"]
["EXIO Hybrid","Natural Gas","NG","LU",502.7130515944839,"g/kWh","activity"]
["EXIO Hybrid","Natural Gas","NG","LV",648.3850747416094,"g/kWh","activity"]
["EXIO Hybrid","Natural Gas","NG","NL",628.3126761679424,"g/kWh","activity"]
["EXIO Hybrid","Natural Gas","NG","PL",631.120799120771,"g/kWh","activity"]
["EXIO Hybrid","Natural Gas","NG","PT",537.2969076408142,"g/kWh","activity"]
["EXIO Hybrid","Natural Gas","NG","RO",670.4727003708446,"g/kWh","activity"]
["EXIO Hybrid","Natural Gas","NG","SE",910.5060985021067,"g/kWh","activity"]
["EXIO Hybrid","Natural Gas","NG","SI",537.2977700283633,"g/kWh","activity"]
["EXIO Hybrid","Natural Gas","NG","SK",633.7284969470722,"g/kWh","activity"]
["EXIO Hybrid","Natural Gas","NG","US",468.3385911592054,"g/kWh","activity"]
["EXIO Hybrid","Nuclear","NU","BE",0.04305322069487336,"g/kWh","activity"]
["EXIO Hybrid","Nuclear","NU","BG",0.2512924022471037,"g/kWh","activity"]
["EXIO Hybrid","Nuclear","NU","CZ",0.0755134755369971,"g/kWh","activity"]
["EXIO Hybrid","Nuclear","NU","DE",0.04851961990185429,"g/kWh","activity"]
["EXIO Hybrid","Nuclear","NU","ES",0.1183077419644041,"g/kWh","activity"]
["EXIO Hybrid","Nuclear","NU","FI",0.1262725599555801,"g/kWh","activity"]
["EXIO Hybrid","Nuclear","NU","FR",0.03827968878767565,"g/kWh","activity"]
["EXIO Hybrid","Nuclear","NU","HU",0.4982238623257303,"g/kWh","activity"]
["EXIO Hybrid","Nuclear","NU","NL",0.2267979099081424,"g/kWh","activity"]
["EXIO Hybrid","Nuclear","NU","RO",0.3272370025464557,"g/kWh","activity"]
["EXIO Hybrid","Nuclear","NU","SE",0.02112103731923174,"g/kWh","activity"]
["EXIO Hybrid","Nuclear","NU","SI",0.08074750718102193,"g/kWh","activity"]
["EXIO Hybrid","Nuclear","NU","SK",0.3067094455928809,"g/kWh","activity"]
["EXIO Hybrid","Nuclear","NU","US",0.3490917543987388,"g/kWh","activity"]
["EXIO Hybrid","Oil","OI","AT",603.7295392957516,"g/kWh","activity"]
["EXIO Hybrid","Oil","OI","BE",671.3859233326057,"g/kWh","activity"]
["EXIO Hybrid","Oil","OI","BG",893.2325661646308,"g/kWh","activity"]
["EXIO Hybrid","Oil","OI","CY",780.5920991029765,"g/kWh","activity"]
["EXIO Hybrid","Oil","OI","CZ",1112.713611968578,"g/kWh","activity"]
["EXIO Hybrid","Oil","OI","DE",594.3390517531819,"g/kWh","activity"]
["EXIO Hybrid","Oil","OI","DK",595.685206739721,"g/kWh","activity"]
["EXIO Hybrid","Oil","OI","EE",595.6345551622229,"g/kWh","activity"]
["EXIO Hybrid","Oil","OI","EL",980.7302690504016,"g/kWh","activity"]
["EXIO Hybrid","Oil","OI","ES",735.425061297699,"g/kWh","activity"]
["EXIO Hybrid","Oil","OI","FI",756.2423030343141,"g/kWh","activity"]
["EXIO Hybrid","Oil","OI","FR",817.5563943976595,"g/kWh","activity"]
["EXIO Hybrid","Oil","OI","HR",635.489170619677,"g/kWh","activity"]
["EXIO Hybrid","Oil","OI","HU",1113.325015847022,"g/kWh","activity"]
["EXIO Hybrid","Oil","OI","IE",758.8550010973136,"g/kWh","activity"]
["EXIO Hybrid","Oil","OI","IT",746.2345352556282,"g/kWh","activity"]
["EXIO Hybrid","Oil","OI","LT",759.36372787423,"g/kWh","activity"]
["EXIO Hybrid","Oil","OI","LU",728.3776517609701,"g/kWh","activity"]
["EXIO Hybrid","Oil","OI","LV",759.0134450937701,"g/kWh","activity"]
["EXIO Hybrid","Oil","OI","MT",887.1773605393865,"g/kWh","activity"]
["EXIO Hybrid","Oil","OI","NL",509.2138910907505,"g/kWh","activity"]
["EXIO Hybrid","Oil","OI","PL",748.0659603940778,"g/kWh","activity"]
["EXIO Hybrid","Oil","OI","PT",759.912777097976,"g/kWh","activity"]
["EXIO Hybrid","Oil","OI","RO",774.7315992469562,"g/kWh","activity"]
["EXIO Hybrid","Oil","OI","SE",742.6998183821796,"g/kWh","activity"]
["EXIO Hybrid","Oil","OI","SI",856.0702963488526,"g/kWh","activity"]
["EXIO Hybrid","Oil","OI","SK",656.5161515838817,"g/kWh","activity"]
["EXIO Hybrid","Oil","OI","US",1101.137141215514,"g/kWh","activity"]
["EXIO Hybrid","Solar","PV","AT",0.007323100787367567,"g/kWh","activity"]
["EXIO Hybrid","Solar","PV","BE",0.000222935642587605,"g/kWh","activity"]
["EXIO Hybrid","Solar","PV","CY",0.1024436951174279,"g/kWh","activity"]
["EXIO Hybrid","Solar","PV","CZ",6.1585749878172849E-5,"g/kWh","activity"]
["EXIO Hybrid","Solar","PV","DE",0.005934476368147832,"g/kWh","activity"]
["EXIO Hybrid","Solar","PV","DK",0.01938201848485416,"g/kWh","activity"]
["EXIO Hybrid","Solar","PV","EL",3.5789657308117238E-4,"g/kWh","activity"]
["EXIO Hybrid","Solar","PV","ES",0.008503374162024168,"g/kWh","activity"]
["EXIO Hybrid","Solar","PV","FI",0.09997542717922299,"g/kWh","activity"]
["EXIO Hybrid","Solar","PV","FR",3.3819115297792509E-4,"g/kWh","activity"]
["EXIO Hybrid","Solar","PV","IT",3.0520152259198711E-4,"g/kWh","activity"]
["EXIO Hybrid","Solar","PV","LU",0.2123207248660449,"g/kWh","activity"]
["EXIO Hybrid","Solar","PV","NL",0.07764190615831788,"g/kWh","activity"]
["EXIO Hybrid","Solar","PV","PT",0.02161769973664159,"g/kWh","activity"]
["EXIO Hybrid","Solar","PV","RO",0.05372631995884859,"g/kWh","activity"]
["EXIO Hybrid","Solar","PV","SE",0.005202261087947978,"g/kWh","activity"]
["EXIO Hybrid","Solar","PV","US",0.06543029739067661,"g/kWh","activity"]
["EXIO Hybrid","Solar","ST","ES",7.2134460175309967E-4,"g/kWh","activity"]
["EXIO Hybrid","Solar","ST","US",0.2589019672717241,"g/kWh","activity"]
["EXIO Hybrid","Tide and wave","WA","FR",0.03742949832326069,"g/kWh","activity"]
["EXIO Hybrid","Wind","WI","AT",0.05591772456335781,"g/kWh","activity"]
["EXIO Hybrid","Wind","WI","BE",0.009154803110967684,"g/kWh","activity"]
["EXIO Hybrid","Wind","WI","BG",0.01565279006590193,"g/kWh","activity"]
["EXIO Hybrid","Wind","WI","CZ",0.02746116009227812,"g/kWh","activity"]
["EXIO Hybrid","Wind","WI","DE",0.03032348594933835,"g/kWh","activity"]
["EXIO Hybrid","Wind","WI","DK",0.1067200080966376,"g/kWh","activity"]
["EXIO Hybrid","Wind","WI","EE",0.0597465522315991,"g/kWh","activity"]
["EXIO Hybrid","Wind","WI","EL",0.1197277280143932,"g/kWh","activity"]
["EXIO Hybrid","Wind","WI","ES",0.08145250005248197,"g/kWh","activity"]
["EXIO Hybrid","Wind","WI","FI",0.04887912328486703,"g/kWh","activity"]
["EXIO Hybrid","Wind","WI","FR",0.01278119109879988,"g/kWh","activity"]
["EXIO Hybrid","Wind","WI","HR",0.7281104282753621,"g/kWh","activity"]
["EXIO Hybrid","Wind","WI","HU",0.09356149054255773,"g/kWh","activity"]
["EXIO Hybrid","Wind","WI","IE",0.1918430554183903,"g/kWh","activity"]
["EXIO Hybrid","Wind","WI","IT",0.03549710852022885,"g/kWh","activity"]
["EXIO Hybrid","Wind","WI","LT",0.1635926814196237,"g/kWh","activity"]
["EXIO Hybrid","Wind","WI","LU",0.2628524402430866,"g/kWh","activity"]
["EXIO Hybrid","Wind","WI","LV",0.8027334952748101,"g/kWh","activity"]
["EXIO Hybrid","Wind","WI","NL",0.1509075870285379,"g/kWh","activity"]
["EXIO Hybrid","Wind","WI","PL",0.07606857828448818,"g/kWh","activity"]
["EXIO Hybrid","Wind","WI","PT",0.1099084489138875,"g/kWh","activity"]
["EXIO Hybrid","Wind","WI","RO",1.025842431145772E-3,"g/kWh","activity"]
["EXIO Hybrid","Wind","WI","SE",0.00448735204433433,"g/kWh","activity"]
["EXIO Hybrid","Wind","WI","SK",0.5122319750311457,"g/kWh","activity"]
["EXIO Hybrid","Wind","WI","US",0.09846819391032875,"g/kWh","activity"]
["IPCC","Coal","CO","Global",670,"g/kWh","Median"]
["IPCC","Natural Gas","NG","Global",370,"g/kWh","Median"]

{"sheet":"Stat analysis DCI by tech","index":2,"n_rows":24,"n_cols":12,"rows_kept":24}
["Technology","Source","n","Lower whisker\n(g/kWh)","Q1\n(g/kWh)","Median\n(g/kWh)","Q3\n(g/kWh)","Upper whisker\n(g/kWh)","IQR\n(g/kWh)","Mean\n(g/kWh)","Std Dev\n(g/kWh)","CV%"]
["Biomass and waste","EXIO Hybrid",23,0.5981668219307329,2.303309279616205,6.107401040836938,10.87709682321717,17.78695980632301,8.573787543600968,7.277602812955934,5.488242433561939,0.754127777321333]
["Biomass and waste","Electricity Maps",28,0,0,0,0,0,0,0,0]
["Coal","EXIO Hybrid",23,720.7722904534414,889.828280320776,927.3420213983467,1027.13737593101,1204.071341521711,137.3090956102335,947.7173321566189,107.7721257306462,0.1137175844250951]
["Coal","Electricity Maps",28,923.04,1014.525,1037.31,1076.345,1123.53,61.81999999999994,1031.724119928571,140.2291652713226,0.13591730828298462]
["Coal","IPCC",3,670,715,760,815,870,100,766.6666666666666,100.1665280087781,0.13065199305492797]
["Geothermal","EXIO Hybrid",4,0.08518706382476153,0.1011363084230434,0.172579639229092,0.2597364479813637,0.3228261264183149,0.1586001395583204,0.1882931171753151,0.1125008942413301,0.5974774645457873]
["Geothermal","Electricity Maps",28,0,0,0,0,0,0,2.531423261071429,13.39503282367827,5.2915026221291805]
["Hydro","EXIO Hybrid",26,0.01899359767207669,0.08204608826822393,0.1936497862025049,0.4162487311022974,0.7628862355445197,0.3342026428340735,0.2923762942095863,0.2843147687680543,0.9724275681675028]
["Hydro","Electricity Maps",28,0,0,0,0,0,0,0,0]
["Natural Gas","EXIO Hybrid",26,468.3385911592054,538.3050646366672,632.4246480339216,671.2030520309713,794.7117352550245,132.8979873943041,654.5415114809274,190.3145730200466,0.2907601270230393]
["Natural Gas","Electricity Maps",28,364.25,388.8425,409.295,410.39,441.99,21.54749999999996,409.0247962928571,52.65898396252143,0.1287427667950434]
["Natural Gas","IPCC",3,350,360,370,430,490,70,403.3333333333333,75.71877794400365,0.18773250729918262]
["Nuclear","EXIO Hybrid",14,0.02112103731923174,0.05526808381064,0.1222901509599921,0.2928551847564366,0.4982238623257303,0.2375871009457966,0.1793690877400493,0.1477235699417398,0.8235731797656696]
["Nuclear","Electricity Maps",28,0,0,0,0,0,0,0,0]
["Oil","EXIO Hybrid",28,509.2138910907505,667.6684803954247,757.5486520658138,827.1848698854577,980.7302690504016,159.516389490033,774.0517901695687,156.4668625249542,0.2021400434855626]
["Oil","Electricity Maps",28,373.49,641.08,641.08,877.0350000000001,925.95,235.955,716.9710238892858,143.1662718979646,0.19968208913289676]
["Solar","EXIO Hybrid",19,6.1585749878172849E-5,0.000539620587417136,0.008503374162024168,0.07153610177449725,0.1024436951174279,0.07099648118708012,0.04949528546379559,0.07464071490635739,1.5080368606208963]
["Solar","Electricity Maps",28,0,0,0,0,0,0,0,0]
["Tide and wave","EXIO Hybrid",1,0.03742949832326069,0.03742949832326069,0.03742949832326069,0.03742949832326069,0.03742949832326069,0,0.03742949832326069,null,0]
["Wind","EXIO Hybrid",25,1.025842431145772E-3,0.03032348594933835,0.08145250005248197,0.1509075870285379,0.2628524402430866,0.1205841010791995,0.151964229755942,0.2137187785918832,1.4063755591373075]
["Wind","Electricity Maps",28,0,0,0,0,0,0,0,0]
[]
["IEA values are not shown due to license restrictions"]

{"sheet":"LCCI by technology","index":3,"n_rows":2229,"n_cols":8,"rows_kept":2229}
["Source","Technology_aggr","Technology","Country","GWP100","Unit","Notes","Data from figure 1b in manuscript"]
["Electricity Maps","Natural Gas","NG","AT",500,"g/kWh","EU-ETS, ENTSO-E 2023; IPCC 2014"]
["Electricity Maps","Natural Gas","NG","CZ",484.25,"g/kWh","EU-ETS, ENTSO-E 2023; IPCC 2014"]
["Electricity Maps","Natural Gas","NG","BE",513.56,"g/kWh","EU-ETS, ENTSO-E 2023; IPCC 2014"]
["Electricity Maps","Natural Gas","NG","DE",529.62,"g/kWh","EU-ETS, ENTSO-E 2023; IPCC 2014"]
["Electricity Maps","Natural Gas","NG","PT",495.95,"g/kWh","EU-ETS, ENTSO-E 2023; IPCC 2014"]
["Electricity Maps","Natural Gas","NG","SE",432.59,"g/kWh","EU-ETS, ENTSO-E 2023; IPCC 2014"]
["Electricity Maps","Natural Gas","NG","HU",561.99,"g/kWh","EU-ETS, ENTSO-E 2023; IPCC 2014"]
["Electricity Maps","Natural Gas","NG","DK",419.26,"g/kWh","EU-ETS, ENTSO-E 2023; IPCC 2014"]
["Electricity Maps","Natural Gas","NG","SK",634.8,"g/kWh","EU-ETS, ENTSO-E 2023; IPCC 2014"]
["Electricity Maps","Natural Gas","NG","FR",511.79,"g/kWh","EU-ETS, ENTSO-E 2023; IPCC 2014"]
["Electricity Maps","Natural Gas","NG","FI",596.61,"g/kWh","EU-ETS, ENTSO-E 2023; IPCC 2014"]
["Electricity Maps","Natural Gas","NG","EL",516.14,"g/kWh","EU-ETS, ENTSO-E 2023; IPCC 2014"]
["Electricity Maps","Natural Gas","NG","NL",524.39,"g/kWh","EU-ETS, ENTSO-E 2023; IPCC 2014"]
["Electricity Maps","Natural Gas","NG","IE",593.89,"g/kWh","EU-ETS, ENTSO-E 2023; IPCC 2014"]
["Electricity Maps","Natural Gas","NG","BG",530.39,"g/kWh","EU-ETS, ENTSO-E 2023; IPCC 2014"]
["Electricity Maps","Natural Gas","NG","CY",530.39,"g/kWh","EU-ETS, ENTSO-E 2023; IPCC 2014"]
["Electricity Maps","Natural Gas","NG","EE",530.39,"g/kWh","EU-ETS, ENTSO-E 2023; IPCC 2014"]
["Electricity Maps","Natural Gas","NG","HR",530.39,"g/kWh","EU-ETS, ENTSO-E 2023; IPCC 2014"]
["Electricity Maps","Natural Gas","NG","LU",530.39,"g/kWh","EU-ETS, ENTSO-E 2023; IPCC 2014"]
["Electricity Maps","Natural Gas","NG","MT",530.39,"g/kWh","EU-ETS, ENTSO-E 2023; IPCC 2014"]
["Electricity Maps","Natural Gas","NG","SI",530.39,"g/kWh","EU-ETS, ENTSO-E 2023; IPCC 2014"]
["Electricity Maps","Natural Gas","NG","RO",687.48,"g/kWh","EU-ETS, ENTSO-E 2023; IPCC 2014"]
["Electricity Maps","Natural Gas","NG","LV",491.24,"g/kWh","EU-ETS, ENTSO-E 2023; IPCC 2014"]
["Electricity Maps","Natural Gas","NG","IT",535.98,"g/kWh","EU-ETS, ENTSO-E 2023; IPCC 2014"]
["Electricity Maps","Natural Gas","NG","LT",495.63,"g/kWh","EU-ETS, ENTSO-E 2023; IPCC 2014"]
["Electricity Maps","Natural Gas","NG","ES",519.79,"g/kWh","EU-ETS, ENTSO-E 2023; IPCC 2014"]
["Electricity Maps","Natural Gas","NG","PL",528.97,"g/kWh","EU-ETS, ENTSO-E 2023; IPCC 2014"]
["Electricity Maps","Oil","OI","FR",901.06,"g/kWh","EU-ETS, ENTSO-E 2023; IPCC 2014"]
["Electricity Maps","Oil","OI","IT",1104.73,"g/kWh","EU-ETS, ENTSO-E 2023; IPCC 2014"]
["Electricity Maps","Oil","OI","SE",617.49,"g/kWh","EU-ETS, ENTSO-E 2023; IPCC 2014"]
["Electricity Maps","Oil","OI","AT",885.08,"g/kWh","EU-ETS, ENTSO-E 2023; IPCC 2014"]
["Electricity Maps","Oil","OI","BE",885.08,"g/kWh","EU-ETS, ENTSO-E 2023; IPCC 2014"]
["Electricity Maps","Oil","OI","CY",885.08,"g/kWh","EU-ETS, ENTSO-E 2023; IPCC 2014"]
["Electricity Maps","Oil","OI","DE",885.08,"g/kWh","EU-ETS, ENTSO-E 2023; IPCC 2014"]
["Electricity Maps","Oil","OI","DK",885.08,"g/kWh","EU-ETS, ENTSO-E 2023; IPCC 2014"]
["Electricity Maps","Oil","OI","EE",885.08,"g/kWh","EU-ETS, ENTSO-E 2023; IPCC 2014"]
["Electricity Maps","Oil","OI","ES",885.08,"g/kWh","EU-ETS, ENTSO-E 2023; IPCC 2014"]
["Electricity Maps","Oil","OI","FI",885.08,"g/kWh","EU-ETS, ENTSO-E 2023; IPCC 2014"]
["Electricity Maps","Oil","OI","HR",885.08,"g/kWh","EU-ETS, ENTSO-E 2023; IPCC 2014"]
["Electricity Maps","Oil","OI","HU",885.08,"g/kWh","EU-ETS, ENTSO-E 2023; IPCC 2014"]
["Electricity Maps","Oil","OI","IE",885.08,"g/kWh","EU-ETS, ENTSO-E 2023; IPCC 2014"]
["Electricity Maps","Oil","OI","LV",885.08,"g/kWh","EU-ETS, ENTSO-E 2023; IPCC 2014"]
["Electricity Maps","Oil","OI","MT",885.08,"g/kWh","EU-ETS, ENTSO-E 2023; IPCC 2014"]
["Electricity Maps","Oil","OI","PL",885.08,"g/kWh","EU-ETS, ENTSO-E 2023; IPCC 2014"]
["Electricity Maps","Oil","OI","RO",885.08,"g/kWh","EU-ETS, ENTSO-E 2023; IPCC 2014"]
["Electricity Maps","Oil","OI","SI",885.08,"g/kWh","EU-ETS, ENTSO-E 2023; IPCC 2014"]
["Electricity Maps","Oil","OI","SK",885.08,"g/kWh","EU-ETS, ENTSO-E 2023; IPCC 2014"]
["Electricity Maps","Oil","OI","BG",1169.95,"g/kWh","EU-ETS, ENTSO-E 2022; IPCC 2014"]
["Electricity Maps","Oil","OI","CZ",1169.95,"g/kWh","EU-ETS, ENTSO-E 2022; IPCC 2014"]
["Electricity Maps","Oil","OI","EL",1169.95,"g/kWh","EU-ETS, ENTSO-E 2022; IPCC 2014"]
["Electricity Maps","Oil","OI","LT",1169.95,"g/kWh","EU-ETS, ENTSO-E 2022; IPCC 2014"]
["Electricity Maps","Oil","OI","LU",1169.95,"g/kWh","EU-ETS, ENTSO-E 2022; IPCC 2014"]
["Electricity Maps","Oil","OI","NL",1169.95,"g/kWh","EU-ETS, ENTSO-E 2022; IPCC 2014"]
["Electricity Maps","Oil","OI","PT",1169.95,"g/kWh","EU-ETS, ENTSO-E 2022; IPCC 2014"]
["Electricity Maps","Coal","CO","LU",1135.5,"g/kWh","EU-ETS, ENTSO-E 2022; IPCC 2014"]
["Electricity Maps","Coal","CO","BE",1097.31,"g/kWh","EU-ETS, ENTSO-E 2023; IPCC 2014"]
["Electricity Maps","Coal","CO","CY",1097.31,"g/kWh","EU-ETS, ENTSO-E 2023; IPCC 2014"]
["Electricity Maps","Coal","CO","EE",1097.31,"g/kWh","EU-ETS, ENTSO-E 2023; IPCC 2014"]
["Electricity Maps","Coal","CO","HR",1097.31,"g/kWh","EU-ETS, ENTSO-E 2023; IPCC 2014"]
["Electricity Maps","Coal","CO","LT",1097.31,"g/kWh","EU-ETS, ENTSO-E 2023; IPCC 2014"]
["Electricity Maps","Coal","CO","LV",1097.31,"g/kWh","EU-ETS, ENTSO-E 2023; IPCC 2014"]
["Electricity Maps","Coal","CO","MT",1097.31,"g/kWh","EU-ETS, ENTSO-E 2023; IPCC 2014"]
["Electricity Maps","Coal","CO","SI",1097.31,"g/kWh","EU-ETS, ENTSO-E 2023; IPCC 2014"]
["Electricity Maps","Coal","CO","CZ",1111.99,"g/kWh","EU-ETS, ENTSO-E 2023; IPCC 2014"]
["Electricity Maps","Coal","CO","NL",859.37,"g/kWh","EU-ETS, ENTSO-E 2023; IPCC 2014"]
["Electricity Maps","Coal","CO","SE",1171.867209,"g/kWh","EU-ETS, ENTSO-E 2022; Oberschelp, Christopher, et al. \"Global emission hotspots of coal power generation.\""]
["Electricity Maps","Coal","CO","SK",824.9,"g/kWh","EU-ETS, ENTSO-E 2023; IPCC 2014"]
["Electricity Maps","Coal","CO","ES",1281.36,"g/kWh","EU-ETS, ENTSO-E 2023; IPCC 2014"]
["Electricity Maps","Coal","CO","AT",1187.127343,"g/kWh","EU-ETS, ENTSO-E 2022; Oberschelp, Christopher, et al. \"Global emission hotspots of coal power generation.\""]
["Electricity Maps","Coal","CO","BG",1183.53,"g/kWh","EU-ETS, ENTSO-E 2023; IPCC 2014"]
["Electricity Maps","Coal","CO","IT",1061.28,"g/kWh","EU-ETS, ENTSO-E 2023; IPCC 2014"]
["Electricity Maps","Coal","CO","EL",1278.46,"g/kWh","EU-ETS, ENTSO-E 2023; IPCC 2014"]
["Electricity Maps","Coal","CO","PT",1118.213761,"g/kWh","EU-ETS, ENTSO-E 2022; Oberschelp, Christopher, et al. \"Global emission hotspots of coal power generation.\""]
["Electricity Maps","Coal","CO","DK",780.51,"g/kWh","EU-ETS, ENTSO-E 2023; IPCC 2014"]
["Electricity Maps","Coal","CO","FR",983.04,"g/kWh","EU-ETS, ENTSO-E 2023; IPCC 2014"]
["Electricity Maps","Coal","CO","FI",778.07,"g/kWh","EU-ETS, ENTSO-E 2023; IPCC 2014"]
["Electricity Maps","Coal","CO","IE",1261.64,"g/kWh","EU-ETS, ENTSO-E 2023; IPCC 2014"]
["Electricity Maps","Coal","CO","HU",1291.95,"g/kWh","EU-ETS, ENTSO-E 2023; IPCC 2014"]
["Electricity Maps","Coal","CO","RO",1284.26,"g/kWh","EU-ETS, ENTSO-E 2023; IPCC 2014"]
["Electricity Maps","Coal","CO","PL",1138.88,"g/kWh","EU-ETS, ENTSO-E 2023; IPCC 2014"]
["Electricity Maps","Coal","CO","DE",1078.94,"g/kWh","EU-ETS, ENTSO-E 2023; IPCC 2014"]
["Electricity Maps","Wind","WI","AT",12.62,"g/kWh","UNECE 2022, WindEurope \"Wind energy in Europe, 2021 Statistics and the outlook for 2022-2026\" Wind Europe Proceedings (2021)"]
["Electricity Maps","Wind","WI","BE",12.62,"g/kWh","UNECE 2022, WindEurope \"Wind energy in Europe, 2021 Statistics and the outlook for 2022-2026\" Wind Europe Proceedings (2021)"]
["Electricity Maps","Wind","WI","BG",12.62,"g/kWh","UNECE 2022, WindEurope \"Wind energy in Europe, 2021 Statistics and the outlook for 2022-2026\" Wind Europe Proceedings (2021)"]
["Electricity Maps","Wind","WI","CY",12.62,"g/kWh","UNECE 2022, WindEurope \"Wind energy in Europe, 2021 Statistics and the outlook for 2022-2026\" Wind Europe Proceedings (2021)"]
["Electricity Maps","Wind","WI","CZ",12.62,"g/kWh","UNECE 2022, WindEurope \"Wind energy in Europe, 2021 Statistics and the outlook for 2022-2026\" Wind Europe Proceedings (2021)"]
["Electricity Maps","Wind","WI","DE",12.62,"g/kWh","UNECE 2022, WindEurope \"Wind energy in Europe, 2021 Statistics and the outlook for 2022-2026\" Wind Europe Proceedings (2021)"]
["Electricity Maps","Wind","WI","DK",12.62,"g/kWh","UNECE 2022, WindEurope \"Wind energy in Europe, 2021 Statistics and the outlook for 2022-2026\" Wind Europe Proceedings (2021)"]
["Electricity Maps","Wind","WI","EE",12.62,"g/kWh","UNECE 2022, WindEurope \"Wind energy in Europe, 2021 Statistics and the outlook for 2022-2026\" Wind Europe Proceedings (2021)"]
["Electricity Maps","Wind","WI","ES",12.62,"g/kWh","UNECE 2022, WindEurope \"Wind energy in Europe, 2021 Statistics and the outlook for 2022-2026\" Wind Europe Proceedings (2021)"]
["Electricity Maps","Wind","WI","FI",12.62,"g/kWh","UNECE 2022, WindEurope \"Wind energy in Europe, 2021 Statistics and the outlook for 2022-2026\" Wind Europe Proceedings (2021)"]
["Electricity Maps","Wind","WI","FR",12.62,"g/kWh","UNECE 2022, WindEurope \"Wind energy in Europe, 2021 Statistics and the outlook for 2022-2026\" Wind Europe Proceedings (2021)"]
["Electricity Maps","Wind","WI","EL",12.62,"g/kWh","UNECE 2022, WindEurope \"Wind energy in Europe, 2021 Statistics and the outlook for 2022-2026\" Wind Europe Proceedings (2021)"]
["Electricity Maps","Wind","WI","HR",12.62,"g/kWh","UNECE 2022, WindEurope \"Wind energy in Europe, 2021 Statistics and the outlook for 2022-2026\" Wind Europe Proceedings (2021)"]
["Electricity Maps","Wind","WI","HU",12.62,"g/kWh","UNECE 2022, WindEurope \"Wind energy in Europe, 2021 Statistics and the outlook for 2022-2026\" Wind Europe Proceedings (2021)"]
["Electricity Maps","Wind","WI","IE",12.62,"g/kWh","UNECE 2022, WindEurope \"Wind energy in Europe, 2021 Statistics and the outlook for 2022-2026\" Wind Europe Proceedings (2021)"]
["Electricity Maps","Wind","WI","IT",12.62,"g/kWh","UNECE 2022, WindEurope \"Wind energy in Europe, 2021 Statistics and the outlook for 2022-2026\" Wind Europe Proceedings (2021)"]
["Electricity Maps","Wind","WI","LT",12.62,"g/kWh","UNECE 2022, WindEurope \"Wind energy in Europe, 2021 Statistics and the outlook for 2022-2026\" Wind Europe Proceedings (2021)"]
["Electricity Maps","Wind","WI","LU",12.62,"g/kWh","UNECE 2022, WindEurope \"Wind energy in Europe, 2021 Statistics and the outlook for 2022-2026\" Wind Europe Proceedings (2021)"]
["Electricity Maps","Wind","WI","LV",12.62,"g/kWh","UNECE 2022, WindEurope \"Wind energy in Europe, 2021 Statistics and the outlook for 2022-2026\" Wind Europe Proceedings (2021)"]
["Electricity Maps","Wind","WI","MT",12.62,"g/kWh","UNECE 2022, WindEurope \"Wind energy in Europe, 2021 Statistics and the outlook for 2022-2026\" Wind Europe Proceedings (2021)"]
["Electricity Maps","Wind","WI","NL",12.62,"g/kWh","UNECE 2022, WindEurope \"Wind energy in Europe, 2021 Statistics and the outlook for 2022-2026\" Wind Europe Proceedings (2021)"]
["Electricity Maps","Wind","WI","PL",12.62,"g/kWh","UNECE 2022, WindEurope \"Wind energy in Europe, 2021 Statistics and the outlook for 2022-2026\" Wind Europe Proceedings (2021)"]
["Electricity Maps","Wind","WI","PT",12.62,"g/kWh","UNECE 2022, WindEurope \"Wind energy in Europe, 2021 Statistics and the outlook for 2022-2026\" Wind Europe Proceedings (2021)"]
["Electricity Maps","Wind","WI","RO",12.62,"g/kWh","UNECE 2022, WindEurope \"Wind energy in Europe, 2021 Statistics and the outlook for 2022-2026\" Wind Europe Proceedings (2021)"]
["Electricity Maps","Wind","WI","SE",12.62,"g/kWh","UNECE 2022, WindEurope \"Wind energy in Europe, 2021 Statistics and the outlook for 2022-2026\" Wind Europe Proceedings (2021)"]
["Electricity Maps","Wind","WI","SI",12.62,"g/kWh","UNECE 2022, WindEurope \"Wind energy in Europe, 2021 Statistics and the outlook for 2022-2026\" Wind Europe Proceedings (2021)"]
["Electricity Maps","Wind","WI","SK",12.62,"g/kWh","UNECE 2022, WindEurope \"Wind energy in Europe, 2021 Statistics and the outlook for 2022-2026\" Wind Europe Proceedings (2021)"]
["Electricity Maps","Hydro","HY","AT",10.7,"g/kWh","UNECE 2022"]
["Electricity Maps","Hydro","HY","BE",10.7,"g/kWh","UNECE 2022"]
["Electricity Maps","Hydro","HY","BG",10.7,"g/kWh","UNECE 2022"]
["Electricity Maps","Hydro","HY","CY",10.7,"g/kWh","UNECE 2022"]
["Electricity Maps","Hydro","HY","CZ",10.7,"g/kWh","UNECE 2022"]
["Electricity Maps","Hydro","HY","DE",10.7,"g/kWh","UNECE 2022"]
["Electricity Maps","Hydro","HY","DK",10.7,"g/kWh","UNECE 2022"]
["Electricity Maps","Hydro","HY","EE",10.7,"g/kWh","UNECE 2022"]
["Electricity Maps","Hydro","HY","ES",10.7,"g/kWh","UNECE 2022"]
["Electricity Maps","Hydro","HY","FI",10.7,"g/kWh","UNECE 2022"]
["Electricity Maps","Hydro","HY","FR",10.7,"g/kWh","UNECE 2022"]
["Electricity Maps","Hydro","HY","EL",10.7,"g/kWh","UNECE 2022"]
["Electricity Maps","Hydro","HY","HR",10.7,"g/kWh","UNECE 2022"]
["Electricity Maps","Hydro","HY","HU",10.7,"g/kWh","UNECE 2022"]
["Electricity Maps","Hydro","HY","IE",10.7,"g/kWh","UNECE 2022"]
["Electricity Maps","Hydro","HY","IT",10.7,"g/kWh","UNECE 2022"]
["Electricity Maps","Hydro","HY","LT",10.7,"g/kWh","UNECE 2022"]
["Electricity Maps","Hydro","HY","LU",10.7,"g/kWh","UNECE 2022"]
["Electricity Maps","Hydro","HY","LV",10.7,"g/kWh","UNECE 2022"]
["Electricity Maps","Hydro","HY","MT",10.7,"g/kWh","UNECE 2022"]
["Electricity Maps","Hydro","HY","NL",10.7,"g/kWh","UNECE 2022"]
["Electricity Maps","Hydro","HY","PL",10.7,"g/kWh","UNECE 2022"]
["Electricity Maps","Hydro","HY","PT",10.7,"g/kWh","UNECE 2022"]
["Electricity Maps","Hydro","HY","RO",10.7,"g/kWh","UNECE 2022"]
["Electricity Maps","Hydro","HY","SE",10.7,"g/kWh","UNECE 2022"]
["Electricity Maps","Hydro","HY","SI",10.7,"g/kWh","UNECE 2022"]
["Electricity Maps","Hydro","HY","SK",10.7,"g/kWh","UNECE 2022"]
["Electricity Maps","Solar","SO","AT",31,"g/kWh","INCER ACV"]
["Electricity Maps","Solar","SO","BE",36,"g/kWh","INCER ACV"]
["Electricity Maps","Solar","SO","EE",36.5,"g/kWh","INCER ACV"]
["Electricity Maps","Solar","SO","NL",36.5,"g/kWh","INCER ACV"]
["Electricity Maps","Solar","SO","SK",33,"g/kWh","INCER ACV"]
["Electricity Maps","Solar","SO","FI",45,"g/kWh","IPCC 2014"]
["Electricity Maps","Solar","SO","LU",45,"g/kWh","IPCC 2014"]
["Electricity Maps","Solar","SO","MT",45,"g/kWh","IPCC 2014"]
["Electricity Maps","Solar","SO","SE",40.81666667,"g/kWh","INCER ACV"]
["Electricity Maps","Solar","SO","CZ",34.33333333,"g/kWh","INCER ACV"]
["Electricity Maps","Solar","SO","FR",30.075,"g/kWh","INCER ACV"]
["Electricity Maps","Solar","SO","LV",36.9,"g/kWh","INCER ACV"]
["Electricity Maps","Solar","SO","RO",29.78,"g/kWh","INCER ACV"]
["Electricity Maps","Solar","SO","SI",30.83333333,"g/kWh","INCER ACV"]
["Electricity Maps","Solar","SO","DE",35.11666667,"g/kWh","INCER ACV"]
["Electricity Maps","Solar","SO","HR",29.03333333,"g/kWh","INCER ACV"]
["Electricity Maps","Solar","SO","ES",26.46666667,"g/kWh","INCER ACV"]
["Electricity Maps","Solar","SO","IE",42.13333333,"g/kWh","INCER ACV"]
["Electricity Maps","Solar","SO","EL",26.1,"g/kWh","INCER ACV"]
["Electricity Maps","Solar","SO","LT",36.7,"g/kWh","INCER ACV"]
["Electricity Maps","Solar","SO","CY",25.6,"g/kWh","INCER ACV"]
["Electricity Maps","Solar","SO","PT",25.6,"g/kWh","INCER ACV"]
["Electricity Maps","Solar","SO","IT",26.26527778,"g/kWh","INCER ACV"]
["Electricity Maps","Solar","SO","BG",27.73333333,"g/kWh","INCER ACV"]
["Electricity Maps","Solar","SO","HU",30.66666667,"g/kWh","INCER ACV"]
["Electricity Maps","Solar","SO","DK",35.98888889,"g/kWh","INCER ACV"]
["Electricity Maps","Solar","SO","PL",34.84,"g/kWh","INCER ACV"]
["Electricity Maps","Biomass and waste","BWB","AT",230,"g/kWh","BEIS 2021; IPCC 2014"]
["Electricity Maps","Biomass and waste","BWB","BE",230,"g/kWh","BEIS 2021; IPCC 2014"]
["Electricity Maps","Biomass and waste","BWB","BG",230,"g/kWh","BEIS 2021; IPCC 2014"]
["Electricity Maps","Biomass and waste","BWB","CY",230,"g/kWh","BEIS 2021; IPCC 2014"]
["Electricity Maps","Biomass and waste","BWB","CZ",230,"g/kWh","BEIS 2021; IPCC 2014"]
["Electricity Maps","Biomass and waste","BWB","DE",230,"g/kWh","BEIS 2021; IPCC 2014"]
["Electricity Maps","Biomass and waste","BWB","DK",230,"g/kWh","BEIS 2021; IPCC 2014"]
["Electricity Maps","Biomass and waste","BWB","EE",230,"g/kWh","BEIS 2021; IPCC 2014"]
["Electricity Maps","Biomass and waste","BWB","ES",230,"g/kWh","BEIS 2021; IPCC 2014"]
["Electricity Maps","Biomass and waste","BWB","FI",230,"g/kWh","BEIS 2021; IPCC 2014"]
["Electricity Maps","Biomass and waste","BWB","FR",230,"g/kWh","BEIS 2021; IPCC 2014"]
["Electricity Maps","Biomass and waste","BWB","EL",230,"g/kWh","BEIS 2021; IPCC 2014"]
["Electricity Maps","Biomass and waste","BWB","HR",230,"g/kWh","BEIS 2021; IPCC 2014"]
["Electricity Maps","Biomass and waste","BWB","HU",230,"g/kWh","BEIS 2021; IPCC 2014"]
["Electricity Maps","Biomass and waste","BWB","IE",230,"g/kWh","BEIS 2021; IPCC 2014"]
["Electricity Maps","Biomass and waste","BWB","IT",230,"g/kWh","BEIS 2021; IPCC 2014"]
["Electricity Maps","Biomass and waste","BWB","LT",230,"g/kWh","BEIS 2021; IPCC 2014"]
["Electricity Maps","Biomass and waste","BWB","LU",230,"g/kWh","BEIS 2021; IPCC 2014"]
["Electricity Maps","Biomass and waste","BWB","LV",230,"g/kWh","BEIS 2021; IPCC 2014"]
["Electricity Maps","Biomass and waste","BWB","MT",230,"g/kWh","BEIS 2021; IPCC 2014"]
["Electricity Maps","Biomass and waste","BWB","NL",230,"g/kWh","BEIS 2021; IPCC 2014"]
["Electricity Maps","Biomass and waste","BWB","PL",230,"g/kWh","BEIS 2021; IPCC 2014"]
["Electricity Maps","Biomass and waste","BWB","PT",230,"g/kWh","BEIS 2021; IPCC 2014"]
["Electricity Maps","Biomass and waste","BWB","RO",230,"g/kWh","BEIS 2021; IPCC 2014"]
["Electricity Maps","Biomass and waste","BWB","SE",230,"g/kWh","BEIS 2021; IPCC 2014"]
["Electricity Maps","Biomass and waste","BWB","SI",230,"g/kWh","BEIS 2021; IPCC 2014"]
["Electricity Maps","Biomass and waste","BWB","SK",230,"g/kWh","BEIS 2021; IPCC 2014"]
["Electricity Maps","Nuclear","NU","AT",5.13,"g/kWh","UNECE 2022"]
["Electricity Maps","Nuclear","NU","BE",5.13,"g/kWh","UNECE 2022"]
["Electricity Maps","Nuclear","NU","BG",5.13,"g/kWh","UNECE 2022"]
["Electricity Maps","Nuclear","NU","CY",5.13,"g/kWh","UNECE 2022"]
["Electricity Maps","Nuclear","NU","CZ",5.13,"g/kWh","UNECE 2022"]
["Electricity Maps","Nuclear","NU","DE",5.13,"g/kWh","UNECE 2022"]
["Electricity Maps","Nuclear","NU","DK",5.13,"g/kWh","UNECE 2022"]
["Electricity Maps","Nuclear","NU","EE",5.13,"g/kWh","UNECE 2022"]
["Electricity Maps","Nuclear","NU","ES",5.13,"g/kWh","UNECE 2022"]
["Electricity Maps","Nuclear","NU","FI",5.13,"g/kWh","UNECE 2022"]
["Electricity Maps","Nuclear","NU","FR",5.13,"g/kWh","UNECE 2022"]
["Electricity Maps","Nuclear","NU","EL",5.13,"g/kWh","UNECE 2022"]
["Electricity Maps","Nuclear","NU","HR",5.13,"g/kWh","UNECE 2022"]
["Electricity Maps","Nuclear","NU","HU",5.13,"g/kWh","UNECE 2022"]
["Electricity Maps","Nuclear","NU","IE",5.13,"g/kWh","UNECE 2022"]
["Electricity Maps","Nuclear","NU","IT",5.13,"g/kWh","UNECE 2022"]
["Electricity Maps","Nuclear","NU","LT",5.13,"g/kWh","UNECE 2022"]
["Electricity Maps","Nuclear","NU","LU",5.13,"g/kWh","UNECE 2022"]
["Electricity Maps","Nuclear","NU","LV",5.13,"g/kWh","UNECE 2022"]
["Electricity Maps","Nuclear","NU","MT",5.13,"g/kWh","UNECE 2022"]
["Electricity Maps","Nuclear","NU","NL",5.13,"g/kWh","UNECE 2022"]
["Electricity Maps","Nuclear","NU","PL",5.13,"g/kWh","UNECE 2022"]
["Electricity Maps","Nuclear","NU","PT",5.13,"g/kWh","UNECE 2022"]
["Electricity Maps","Nuclear","NU","RO",5.13,"g/kWh","UNECE 2022"]
["Electricity Maps","Nuclear","NU","SE",5.13,"g/kWh","UNECE 2022"]
["Electricity Maps","Nuclear","NU","SI",5.13,"g/kWh","UNECE 2022"]
["Electricity Maps","Nuclear","NU","SK",5.13,"g/kWh","UNECE 2022"]
["Electricity Maps","Nec","NC","HR",240,"g/kWh","HOPS 2018; HOPS 2018 derived calculation"]
["Electricity Maps","Nec","NC","SE",258,"g/kWh","assumes 98.26% biomass, 1.09% oil, 0.64% peat, 0.01% coal"]
["Electricity Maps","Nec","NC","NL",342,"g/kWh","Electricity Maps, 2020 average. See disclaimer"]
["Electricity Maps","Nec","NC","AT",700,"g/kWh","assumes thermal (coal, gas, oil or biomass)"]
["Electricity Maps","Nec","NC","BE",700,"g/kWh","assumes thermal (coal, gas, oil or biomass)"]
["Electricity Maps","Nec","NC","BG",700,"g/kWh","assumes thermal (coal, gas, oil or biomass)"]
["Electricity Maps","Nec","NC","CY",700,"g/kWh","assumes thermal (coal, gas, oil or biomass)"]
["Electricity Maps","Nec","NC","CZ",700,"g/kWh","assumes thermal (coal, gas, oil or biomass)"]
["Electricity Maps","Nec","NC","DE",700,"g/kWh","assumes thermal (coal, gas, oil or biomass)"]
["Electricity Maps","Nec","NC","DK",700,"g/kWh","assumes thermal (coal, gas, oil or biomass)"]
["Electricity Maps","Nec","NC","EE",700,"g/kWh","assumes thermal (coal, gas, oil or biomass)"]
["Electricity Maps","Nec","NC","ES",700,"g/kWh","assumes thermal (coal, gas, oil or biomass)"]
["Electricity Maps","Nec","NC","FI",700,"g/kWh","assumes thermal (coal, gas, oil or biomass)"]
["Electricity Maps","Nec","NC","FR",700,"g/kWh","assumes thermal (coal, gas, oil or biomass)"]
["Electricity Maps","Nec","NC","EL",700,"g/kWh","assumes thermal (coal, gas, oil or biomass)"]
["Electricity Maps","Nec","NC","HU",700,"g/kWh","assumes thermal (coal, gas, oil or biomass)"]
["Electricity Maps","Nec","NC","IE",700,"g/kWh","assumes thermal (coal, gas, oil or biomass)"]
["Electricity Maps","Nec","NC","IT",700,"g/kWh","assumes thermal (coal, gas, oil or biomass)"]
["Electricity Maps","Nec","NC","LT",700,"g/kWh","assumes thermal (coal, gas, oil or biomass)"]
["Electricity Maps","Nec","NC","LU",700,"g/kWh","assumes thermal (coal, gas, oil or biomass)"]
["Electricity Maps","Nec","NC","LV",700,"g/kWh","assumes thermal (coal, gas, oil or biomass)"]
["Electricity Maps","Nec","NC","MT",700,"g/kWh","assumes thermal (coal, gas, oil or biomass)"]
["Electricity Maps","Nec","NC","PL",700,"g/kWh","assumes thermal (coal, gas, oil or biomass)"]
["Electricity Maps","Nec","NC","PT",700,"g/kWh","assumes thermal (coal, gas, oil or biomass)"]
["Electricity Maps","Nec","NC","RO",700,"g/kWh","assumes thermal (coal, gas, oil or biomass)"]
["Electricity Maps","Nec","NC","SI",700,"g/kWh","assumes thermal (coal, gas, oil or biomass)"]
["Electricity Maps","Nec","NC","SK",700,"g/kWh","assumes thermal (coal, gas, oil or biomass)"]
["Electricity Maps","Geothermal","GE","AT",38,"g/kWh","IPCC 2014"]
["Electricity Maps","Geothermal","GE","BE",38,"g/kWh","IPCC 2014"]
["Electricity Maps","Geothermal","GE","BG",38,"g/kWh","IPCC 2014"]
["Electricity Maps","Geothermal","GE","CY",38,"g/kWh","IPCC 2014"]
["Electricity Maps","Geothermal","GE","CZ",38,"g/kWh","IPCC 2014"]
["Electricity Maps","Geothermal","GE","DE",38,"g/kWh","IPCC 2014"]
["Electricity Maps","Geothermal","GE","DK",38,"g/kWh","IPCC 2014"]
["Electricity Maps","Geothermal","GE","EE",38,"g/kWh","IPCC 2014"]
["Electricity Maps","Geothermal","GE","ES",38,"g/kWh","IPCC 2014"]
["Electricity Maps","Geothermal","GE","FI",38,"g/kWh","IPCC 2014"]
["Electricity Maps","Geothermal","GE","FR",38,"g/kWh","IPCC 2014"]
["Electricity Maps","Geothermal","GE","EL",38,"g/kWh","IPCC 2014"]
["Electricity Maps","Geothermal","GE","HR",38,"g/kWh","IPCC 2014"]
["Electricity Maps","Geothermal","GE","HU",38,"g/kWh","IPCC 2014"]
["Electricity Maps","Geothermal","GE","IE",38,"g/kWh","IPCC 2014"]
["Electricity Maps","Geothermal","GE","IT",38,"g/kWh","IPCC 2014"]
["Electricity Maps","Geothermal","GE","LT",38,"g/kWh","IPCC 2014"]
["Electricity Maps","Geothermal","GE","LU",38,"g/kWh","IPCC 2014"]
["Electricity Maps","Geothermal","GE","LV",38,"g/kWh","IPCC 2014"]
["Electricity Maps","Geothermal","GE","MT",38,"g/kWh","IPCC 2014"]
["Electricity Maps","Geothermal","GE","NL",38,"g/kWh","IPCC 2014"]
["Electricity Maps","Geothermal","GE","PL",38,"g/kWh","IPCC 2014"]
["Electricity Maps","Geothermal","GE","PT",38,"g/kWh","IPCC 2014"]
["Electricity Maps","Geothermal","GE","RO",38,"g/kWh","IPCC 2014"]
["Electricity Maps","Geothermal","GE","SE",38,"g/kWh","IPCC 2014"]
["Electricity Maps","Geothermal","GE","SI",38,"g/kWh","IPCC 2014"]
["Electricity Maps","Geothermal","GE","SK",38,"g/kWh","IPCC 2014"]
["EXIO Hybrid","Biomass and waste","BW","AT",225.473300295181,"g/kWh","Activity"]
["EXIO Hybrid","Biomass and waste","BW","BE",24.89229022420422,"g/kWh","Activity"]
["EXIO Hybrid","Biomass and waste","BW","CZ",446.4340644603344,"g/kWh","Activity"]
["EXIO Hybrid","Biomass and waste","BW","DE",28.15606523868082,"g/kWh","Activity"]
["EXIO Hybrid","Biomass and waste","BW","DK",22.55168624900715,"g/kWh","Activity"]
["EXIO Hybrid","Biomass and waste","BW","EE",34.41807661207947,"g/kWh","Activity"]
["EXIO Hybrid","Biomass and waste","BW","ES",69.01185537123168,"g/kWh","Activity"]
["EXIO Hybrid","Biomass and waste","BW","FI",44.51671412653656,"g/kWh","Activity"]
["EXIO Hybrid","Biomass and waste","BW","FR",36.76095911721659,"g/kWh","Activity"]
["EXIO Hybrid","Biomass and waste","BW","HR",204.1259972842595,"g/kWh","Activity"]
["EXIO Hybrid","Biomass and waste","BW","HU",97.3363699647982,"g/kWh","Activity"]
["EXIO Hybrid","Biomass and waste","BW","IE",51.28202025620563,"g/kWh","Activity"]
["EXIO Hybrid","Biomass and waste","BW","IT",306.9448128285441,"g/kWh","Activity"]
["EXIO Hybrid","Biomass and waste","BW","LT",122.027481411697,"g/kWh","Activity"]
["EXIO Hybrid","Biomass and waste","BW","LV",106.599661264714,"g/kWh","Activity"]
["EXIO Hybrid","Biomass and waste","BW","NL",23.96726808925726,"g/kWh","Activity"]
["EXIO Hybrid","Biomass and waste","BW","PL",117.8344742577202,"g/kWh","Activity"]
["EXIO Hybrid","Biomass and waste","BW","PT",43.77417708845888,"g/kWh","Activity"]
["EXIO Hybrid","Biomass and waste","BW","RO",47.58303440252924,"g/kWh","Activity"]
["EXIO Hybrid","Biomass and waste","BW","SE",36.61329413221802,"g/kWh","Activity"]
["EXIO Hybrid","Biomass and waste","BW","SI",186.4008683589789,"g/kWh","Activity"]
["EXIO Hybrid","Biomass and waste","BW","SK",230.9922707458092,"g/kWh","Activity"]
["EXIO Hybrid","Coal","CO","AT",1694.666083310191,"g/kWh","Activity"]
["EXIO Hybrid","Coal","CO","BE",1754.430774318103,"g/kWh","Activity"]
["EXIO Hybrid","Coal","CO","BG",1649.060589935098,"g/kWh","Activity"]
["EXIO Hybrid","Coal","CO","CZ",2103.588007285959,"g/kWh","Activity"]
["EXIO Hybrid","Coal","CO","DE",1317.231961560265,"g/kWh","Activity"]
["EXIO Hybrid","Coal","CO","DK",1841.416130069201,"g/kWh","Activity"]
["EXIO Hybrid","Coal","CO","EE",1302.799867396473,"g/kWh","Activity"]
["EXIO Hybrid","Coal","CO","EL",1362.041774886904,"g/kWh","Activity"]
["EXIO Hybrid","Coal","CO","ES",1986.714045872913,"g/kWh","Activity"]
["EXIO Hybrid","Coal","CO","FI",1597.247006631328,"g/kWh","Activity"]
["EXIO Hybrid","Coal","CO","FR",1548.077864037874,"g/kWh","Activity"]
["EXIO Hybrid","Coal","CO","HR",1672.664855623041,"g/kWh","Activity"]
["EXIO Hybrid","Coal","CO","HU",1293.679898691849,"g/kWh","Activity"]
["EXIO Hybrid","Coal","CO","IE",1330.287745477113,"g/kWh","Activity"]
["EXIO Hybrid","Coal","CO","IT",1751.544006343485,"g/kWh","Activity"]
["EXIO Hybrid","Coal","CO","NL",1388.521625466122,"g/kWh","Activity"]
["EXIO Hybrid","Coal","CO","PL",1875.705049143895,"g/kWh","Activity"]
["EXIO Hybrid","Coal","CO","PT",1708.154977222827,"g/kWh","Activity"]
["EXIO Hybrid","Coal","CO","RO",1275.078899891821,"g/kWh","Activity"]
["EXIO Hybrid","Coal","CO","SE",1656.335829065379,"g/kWh","Activity"]
["EXIO Hybrid","Coal","CO","SI",1174.35590033162,"g/kWh","Activity"]
["EXIO Hybrid","Coal","CO","SK",1651.71689875664,"g/kWh","Activity"]
["EXIO Hybrid","Geothermal","GE","AT",85.46626832992928,"g/kWh","Activity"]
["EXIO Hybrid","Geothermal","GE","DE",10.67805571107301,"g/kWh","Activity"]
["EXIO Hybrid","Geothermal","GE","IT",58.08240536082916,"g/kWh","Activity"]
["EXIO Hybrid","Geothermal","GE","PT",94.794761516486,"g/kWh","Activity"]
["EXIO Hybrid","Hydro","HY","AT",57.0722717252763,"g/kWh","Activity"]
["EXIO Hybrid","Hydro","HY","BE",76.04527015162111,"g/kWh","Activity"]
["EXIO Hybrid","Hydro","HY","BG",13.61440276007956,"g/kWh","Activity"]
["EXIO Hybrid","Hydro","HY","CZ",30.73410879042269,"g/kWh","Activity"]
["EXIO Hybrid","Hydro","HY","DE",8.539568141597224,"g/kWh","Activity"]
["EXIO Hybrid","Hydro","HY","DK",32.05015867537996,"g/kWh","Activity"]
["EXIO Hybrid","Hydro","HY","EE",33.41467020572161,"g/kWh","Activity"]
["EXIO Hybrid","Hydro","HY","EL",14.19649329127022,"g/kWh","Activity"]
["EXIO Hybrid","Hydro","HY","ES",12.36943494034725,"g/kWh","Activity"]
["EXIO Hybrid","Hydro","HY","FI",11.82328155494491,"g/kWh","Activity"]
["EXIO Hybrid","Hydro","HY","FR",9.617416743653932,"g/kWh","Activity"]
["EXIO Hybrid","Hydro","HY","HR",24.24994720601963,"g/kWh","Activity"]
["EXIO Hybrid","Hydro","HY","HU",93.04132454775298,"g/kWh","Activity"]
["EXIO Hybrid","Hydro","HY","IE",27.0077198444408,"g/kWh","Activity"]
["EXIO Hybrid","Hydro","HY","IT",29.40754615358535,"g/kWh","Activity"]
["EXIO Hybrid","Hydro","HY","LT",79.95687024383594,"g/kWh","Activity"]
["EXIO Hybrid","Hydro","HY","LU",200.7658839296221,"g/kWh","Activity"]
["EXIO Hybrid","Hydro","HY","LV",23.33780607537977,"g/kWh","Activity"]
["EXIO Hybrid","Hydro","HY","NL",98.5003115995253,"g/kWh","Activity"]
["EXIO Hybrid","Hydro","HY","PL",70.88221258390887,"g/kWh","Activity"]
["EXIO Hybrid","Hydro","HY","PT",21.0202786486834,"g/kWh","Activity"]
["EXIO Hybrid","Hydro","HY","RO",10.28717089453584,"g/kWh","Activity"]
["EXIO Hybrid","Hydro","HY","SE",8.116343257053058,"g/kWh","Activity"]
["EXIO Hybrid","Hydro","HY","SI",26.20379652828476,"g/kWh","Activity"]
["EXIO Hybrid","Hydro","HY","SK",48.12501346844218,"g/kWh","Activity"]
["EXIO Hybrid","Nec","NC","AT",141.187446616787,"g/kWh","Activity"]
["EXIO Hybrid","Nec","NC","BE",296.0865376875203,"g/kWh","Activity"]
["EXIO Hybrid","Nec","NC","BG",72.78950593517727,"g/kWh","Activity"]
["EXIO Hybrid","Nec","NC","FI",352.6882213475761,"g/kWh","Activity"]
["EXIO Hybrid","Nec","NC","LT",296.0689253571066,"g/kWh","Activity"]
["EXIO Hybrid","Nec","NC","NL",53.55145014715315,"g/kWh","Activity"]
["EXIO Hybrid","Natural Gas","NG","AT",2043.277424850575,"g/kWh","Activity"]
["EXIO Hybrid","Natural Gas","NG","BE",1040.554708597693,"g/kWh","Activity"]
["EXIO Hybrid","Natural Gas","NG","BG",826.9307588774913,"g/kWh","Activity"]
["EXIO Hybrid","Natural Gas","NG","CZ",1391.595540155862,"g/kWh","Activity"]
["EXIO Hybrid","Natural Gas","NG","DE",1735.099190445794,"g/kWh","Activity"]
["EXIO Hybrid","Natural Gas","NG","DK",899.0399643819194,"g/kWh","Activity"]
["EXIO Hybrid","Natural Gas","NG","EE",856.2376304293527,"g/kWh","Activity"]
["EXIO Hybrid","Natural Gas","NG","EL",850.6277793785857,"g/kWh","Activity"]
["EXIO Hybrid","Natural Gas","NG","ES",961.2387969597005,"g/kWh","Activity"]
["EXIO Hybrid","Natural Gas","NG","FI",5193.61791032544,"g/kWh","Activity"]
["EXIO Hybrid","Natural Gas","NG","FR",1818.271672868804,"g/kWh","Activity"]
["EXIO Hybrid","Natural Gas","NG","HR",823.5122736149358,"g/kWh","Activity"]
["EXIO Hybrid","Natural Gas","NG","HU",917.3928800846089,"g/kWh","Activity"]
["EXIO Hybrid","Natural Gas","NG","IE",816.9623266492902,"g/kWh","Activity"]
["EXIO Hybrid","Natural Gas","NG","IT",1157.411890083816,"g/kWh","Activity"]
["EXIO Hybrid","Natural Gas","NG","LT",1035.046491315001,"g/kWh","Activity"]
["EXIO Hybrid","Natural Gas","NG","LU",782.8834292707111,"g/kWh","Activity"]
["EXIO Hybrid","Natural Gas","NG","LV",1014.939581515303,"g/kWh","Activity"]
["EXIO Hybrid","Natural Gas","NG","NL",874.9169177718964,"g/kWh","Activity"]
["EXIO Hybrid","Natural Gas","NG","PL",1531.386293931855,"g/kWh","Activity"]
["EXIO Hybrid","Natural Gas","NG","PT",880.2611485197785,"g/kWh","Activity"]
["EXIO Hybrid","Natural Gas","NG","RO",1137.532366868931,"g/kWh","Activity"]
["EXIO Hybrid","Natural Gas","NG","SE",2947.926554513252,"g/kWh","Activity"]
["EXIO Hybrid","Natural Gas","NG","SI",830.7895225056537,"g/kWh","Activity"]
["EXIO Hybrid","Natural Gas","NG","SK",1172.917924881943,"g/kWh","Activity"]
["EXIO Hybrid","Nuclear","NU","BE",42.89620931147877,"g/kWh","Activity"]
["EXIO Hybrid","Nuclear","NU","BG",9.475390499553956,"g/kWh","Activity"]
["EXIO Hybrid","Nuclear","NU","CZ",47.93837677742502,"g/kWh","Activity"]
["EXIO Hybrid","Nuclear","NU","DE",25.24474154643087,"g/kWh","Activity"]
["EXIO Hybrid","Nuclear","NU","ES",20.65634895024361,"g/kWh","Activity"]
["EXIO Hybrid","Nuclear","NU","FI",44.99007569005241,"g/kWh","Activity"]
["EXIO Hybrid","Nuclear","NU","FR",21.29967490601525,"g/kWh","Activity"]
["EXIO Hybrid","Nuclear","NU","HU",21.31365334746001,"g/kWh","Activity"]
["EXIO Hybrid","Nuclear","NU","NL",84.58202286491004,"g/kWh","Activity"]
["EXIO Hybrid","Nuclear","NU","RO",6.548429258439501,"g/kWh","Activity"]
["EXIO Hybrid","Nuclear","NU","SE",8.012079301608702,"g/kWh","Activity"]
["EXIO Hybrid","Nuclear","NU","SI",52.56317020533227,"g/kWh","Activity"]
["EXIO Hybrid","Nuclear","NU","SK",27.89804791042472,"g/kWh","Activity"]
["EXIO Hybrid","Oil","OI","AT",1513.102171918399,"g/kWh","Activity"]
["EXIO Hybrid","Oil","OI","BE",1694.087832508859,"g/kWh","Activity"]
["EXIO Hybrid","Oil","OI","BG",2694.975532623689,"g/kWh","Activity"]
["EXIO Hybrid","Oil","OI","CY",1664.188865039489,"g/kWh","Activity"]
["EXIO Hybrid","Oil","OI","CZ",2685.982286352505,"g/kWh","Activity"]
["EXIO Hybrid","Oil","OI","DE",1386.263832238555,"g/kWh","Activity"]
["EXIO Hybrid","Oil","OI","DK",1483.034165129843,"g/kWh","Activity"]
["EXIO Hybrid","Oil","OI","EE",1628.601712050819,"g/kWh","Activity"]
["EXIO Hybrid","Oil","OI","EL",2380.360221630912,"g/kWh","Activity"]
["EXIO Hybrid","Oil","OI","ES",1707.251670326792,"g/kWh","Activity"]
["EXIO Hybrid","Oil","OI","FI",1781.882652659257,"g/kWh","Activity"]
["EXIO Hybrid","Oil","OI","FR",1864.712285239913,"g/kWh","Activity"]
["EXIO Hybrid","Oil","OI","HR",1439.270834566782,"g/kWh","Activity"]
["EXIO Hybrid","Oil","OI","HU",2662.797834345022,"g/kWh","Activity"]
["EXIO Hybrid","Oil","OI","IE",1770.871422791193,"g/kWh","Activity"]
["EXIO Hybrid","Oil","OI","IT",1810.487842531291,"g/kWh","Activity"]
["EXIO Hybrid","Oil","OI","LT",1882.600496537641,"g/kWh","Activity"]
["EXIO Hybrid","Oil","OI","LU",1528.402883335275,"g/kWh","Activity"]
["EXIO Hybrid","Oil","OI","LV",1722.743186298106,"g/kWh","Activity"]
["EXIO Hybrid","Oil","OI","MT",1943.351537124611,"g/kWh","Activity"]
["EXIO Hybrid","Oil","OI","NL",1209.841902320524,"g/kWh","Activity"]
["EXIO Hybrid","Oil","OI","PL",1870.012018489104,"g/kWh","Activity"]
["EXIO Hybrid","Oil","OI","PT",1779.604143382854,"g/kWh","Activity"]
["EXIO Hybrid","Oil","OI","RO",1873.075680282801,"g/kWh","Activity"]
["EXIO Hybrid","Oil","OI","SE",1681.100069214579,"g/kWh","Activity"]
["EXIO Hybrid","Oil","OI","SI",1939.922266556852,"g/kWh","Activity"]
["EXIO Hybrid","Oil","OI","SK",1531.9599420219,"g/kWh","Activity"]
["EXIO Hybrid","Solar","PV","AT",47.09000113873801,"g/kWh","Activity"]
["EXIO Hybrid","Solar","PV","BE",27.36801659234519,"g/kWh","Activity"]
["EXIO Hybrid","Solar","PV","BG",20.54801727300685,"g/kWh","Activity"]
["EXIO Hybrid","Solar","PV","CY",93.63124341890807,"g/kWh","Activity"]
["EXIO Hybrid","Solar","PV","CZ",18.82695969117199,"g/kWh","Activity"]
["EXIO Hybrid","Solar","PV","DE",10.50068366979408,"g/kWh","Activity"]
["EXIO Hybrid","Solar","PV","DK",26.44432738876229,"g/kWh","Activity"]
["EXIO Hybrid","Solar","PV","EL",22.49969326469673,"g/kWh","Activity"]
["EXIO Hybrid","Solar","PV","ES",20.00954509268142,"g/kWh","Activity"]
["EXIO Hybrid","Solar","PV","FI",50.55983435936979,"g/kWh","Activity"]
["EXIO Hybrid","Solar","PV","FR",84.73015168874382,"g/kWh","Activity"]
["EXIO Hybrid","Solar","PV","HU",49.80584185918283,"g/kWh","Activity"]
["EXIO Hybrid","Solar","PV","IT",38.27096701204255,"g/kWh","Activity"]
["EXIO Hybrid","Solar","PV","LU",78.46678537715061,"g/kWh","Activity"]
["EXIO Hybrid","Solar","PV","MT",290.6247612856996,"g/kWh","Activity"]
["EXIO Hybrid","Solar","PV","NL",73.22977933166199,"g/kWh","Activity"]
["EXIO Hybrid","Solar","PV","PT",72.03239443118979,"g/kWh","Activity"]
["EXIO Hybrid","Solar","PV","RO",56.42882564267782,"g/kWh","Activity"]
["EXIO Hybrid","Solar","PV","SE",4.111600333371584,"g/kWh","Activity"]
["EXIO Hybrid","Solar","PV","SI",41.59582926828219,"g/kWh","Activity"]
["EXIO Hybrid","Solar","PV","SK",99.12023507358373,"g/kWh","Activity"]
["EXIO Hybrid","Solar","ST","ES",56.39847141064716,"g/kWh","Activity"]
["EXIO Hybrid","Tide and wave","WA","FR",124.2137989752209,"g/kWh","Activity"]
["EXIO Hybrid","Wind","WI","AT",17.14347204688532,"g/kWh","Activity"]
["EXIO Hybrid","Wind","WI","BE",10.21590552913222,"g/kWh","Activity"]
["EXIO Hybrid","Wind","WI","BG",15.66463780860571,"g/kWh","Activity"]
["EXIO Hybrid","Wind","WI","CY",31.33237070438761,"g/kWh","Activity"]
["EXIO Hybrid","Wind","WI","CZ",40.06913595094741,"g/kWh","Activity"]
["EXIO Hybrid","Wind","WI","DE",8.089644748542296,"g/kWh","Activity"]
["EXIO Hybrid","Wind","WI","DK",36.33344781914219,"g/kWh","Activity"]
["EXIO Hybrid","Wind","WI","EE",26.04410837762729,"g/kWh","Activity"]
["EXIO Hybrid","Wind","WI","EL",16.49361710782473,"g/kWh","Activity"]
["EXIO Hybrid","Wind","WI","ES",12.16207207878011,"g/kWh","Activity"]
["EXIO Hybrid","Wind","WI","FI",36.31821567766475,"g/kWh","Activity"]
["EXIO Hybrid","Wind","WI","FR",19.15930989111414,"g/kWh","Activity"]
["EXIO Hybrid","Wind","WI","HR",10.51071649020392,"g/kWh","Activity"]
["EXIO Hybrid","Wind","WI","HU",56.31514302672112,"g/kWh","Activity"]
["EXIO Hybrid","Wind","WI","IE",11.96207445420369,"g/kWh","Activity"]
["EXIO Hybrid","Wind","WI","IT",42.23894185380168,"g/kWh","Activity"]
["EXIO Hybrid","Wind","WI","LT",71.47089878161168,"g/kWh","Activity"]
["EXIO Hybrid","Wind","WI","LU",203.0813827273109,"g/kWh","Activity"]
["EXIO Hybrid","Wind","WI","LV",85.14579089851956,"g/kWh","Activity"]
["EXIO Hybrid","Wind","WI","NL",8.404440661182067,"g/kWh","Activity"]
["EXIO Hybrid","Wind","WI","PL",52.62117018979363,"g/kWh","Activity"]
["EXIO Hybrid","Wind","WI","PT",15.98013798360234,"g/kWh","Activity"]
["EXIO Hybrid","Wind","WI","RO",16.94589175222292,"g/kWh","Activity"]
["EXIO Hybrid","Wind","WI","SE",28.02232285958003,"g/kWh","Activity"]
["EXIO Hybrid","Wind","WI","SK",149.0580941470577,"g/kWh","Activity"]
["IPCC","Coal","CO","Global",820,"kg/kWh","Median"]
["IPCC","Natural Gas","NG","Global",490,"kg/kWh","Median"]
["IPCC","Biomass and waste","BWB","Global",230,"kg/kWh","Median"]
["IPCC","Geothermal","GE","Global",38,"kg/kWh","Median"]
["IPCC","Hydro","HY","Global",24,"kg/kWh","Median"]
["IPCC","Nuclear","NU","Global",12,"kg/kWh","Median"]
["IPCC","Solar","ST","Global",27,"kg/kWh","Median"]
["IPCC","Solar","PV","Global",48,"kg/kWh","Median"]
["IPCC","Wind","WI","Global",11,"kg/kWh","Median"]
["IPCC","Wind","WI","Global",12,"kg/kWh","Median"]
["IPCC","Tide and wave","WA","Global",17,"kg/kWh","Median"]
["NREL","Wind","WI","Global",13,"kg/kWh","Median"]
["NREL","Solar","PV","Global",43,"kg/kWh","Median"]
["NREL","Solar","ST","Global",28,"kg/kWh","Median"]
["NREL","Nuclear","NU","Global",13,"kg/kWh","Median"]
["NREL","Coal","CO","Global",980,"kg/kWh","Median"]
["NREL","Natural Gas","NG","Global",486,"kg/kWh","Median"]
["NREL","Wind","WI","Global",8,"kg/kWh","Q1"]
["NREL","Solar","PV","Global",35,"kg/kWh","Q1"]
["NREL","Solar","ST","Global",14,"kg/kWh","Q1"]
["NREL","Nuclear","NU","Global",10,"kg/kWh","Q1"]
["NREL","Coal","CO","Global",930,"kg/kWh","Q1"]
["NREL","Natural Gas","NG","Global",427,"kg/kWh","Q1"]
["NREL","Wind","WI","Global",20,"kg/kWh","Q3"]
["NREL","Solar","PV","Global",50,"kg/kWh","Q3"]
["NREL","Solar","ST","Global",32,"kg/kWh","Q3"]
["NREL","Nuclear","NU","Global",39,"kg/kWh","Q3"]
["NREL","Natural Gas","NG","Global",558,"kg/kWh","Q3"]
["NREL","Coal","CO","Global",1050,"kg/kWh","Q3"]
["Electricity Maps","Natural Gas","NG","US",526.0342962,"g/kWh","eGrid 2020; IPCC 2014"]
["Electricity Maps","Oil","OI","US",1047.8986689,"g/kWh","eGrid 2020; IPCC 2014"]
["Electricity Maps","Coal","CO","US",1049.615358,"g/kWh","eGrid 2020; IPCC 2014"]
["Electricity Maps","Wind","WI","US",11,"g/kWh","IPCC 2014"]
["Electricity Maps","Hydro","HY","US",24,"g/kWh","IPCC 2014"]
["Electricity Maps","Solar","SO","US",26.22100877,"g/kWh","INCER ACV"]
["Electricity Maps","Biomass and waste","BWB","US",285.8412641,"g/kWh","eGrid 2020"]
["Electricity Maps","Nuclear","NU","US",12,"g/kWh","IPCC 2014"]
["Electricity Maps","Nec","NC","US",700,"g/kWh","assumes thermal (coal, gas, oil or biomass)"]
["Electricity Maps","Geothermal","GE","US",108.87985131,"g/kWh","eGrid 2020; IPCC 2014"]
["EXIO Hybrid","Biomass and waste","BW","US",23.32862787268288,"g/kWh","Activity"]
["EXIO Hybrid","Coal","CO","US",1924.726698084537,"g/kWh","Activity"]
["EXIO Hybrid","Geothermal","GE","US",13.56416787302156,"g/kWh","Activity"]
["EXIO Hybrid","Hydro","HY","US",1.377716781368655,"g/kWh","Activity"]
["EXIO Hybrid","Natural Gas","NG","US",730.5080348021767,"g/kWh","Activity"]
["EXIO Hybrid","Nuclear","NU","US",3.735328362583353,"g/kWh","Activity"]
["EXIO Hybrid","Oil","OI","US",2420.481106338675,"g/kWh","Activity"]
["EXIO Hybrid","Solar","PV","US",29.84901329483592,"g/kWh","Activity"]
["EXIO Hybrid","Solar","ST","US",75.51921122536147,"g/kWh","Activity"]
["EXIO Hybrid","Wind","WI","US",2.584664057316208,"g/kWh","Activity"]
["Ecoinvent","Coal","CO","Unknown",1113.8299187555988,"g/kWh","De-regionalized (Steubing et al 2022)"]
["Ecoinvent","Coal","CO","Unknown",1241.130689601159,"g/kWh","De-regionalized (Steubing et al 2022)"]
["Ecoinvent","Coal","CO","Unknown",1245.952453667509,"g/kWh","De-regionalized (Steubing et al 2022)"]
["Ecoinvent","Coal","CO","Unknown",985.6735050267467,"g/kWh","De-regionalized (Steubing et al 2022)"]
["Ecoinvent","Coal","CO","Unknown",1218.286631650128,"g/kWh","De-regionalized (Steubing et al 2022)"]
["Ecoinvent","Coal","CO","Unknown",1116.793005443347,"g/kWh","De-regionalized (Steubing et al 2022)"]
["Ecoinvent","Coal","CO","Unknown",926.3768193743277,"g/kWh","De-regionalized (Steubing et al 2022)"]
["Ecoinvent","Coal","CO","Unknown",1438.027830735334,"g/kWh","De-regionalized (Steubing et al 2022)"]
["Ecoinvent","Coal","CO","Unknown",2038.0815415788409,"g/kWh","De-regionalized (Steubing et al 2022)"]
["Ecoinvent","Coal","CO","Unknown",1138.19522050118,"g/kWh","De-regionalized (Steubing et al 2022)"]
["Ecoinvent","Coal","CO","Unknown",1258.511629998314,"g/kWh","De-regionalized (Steubing et al 2022)"]
["Ecoinvent","Coal","CO","Unknown",1236.1568242900369,"g/kWh","De-regionalized (Steubing et al 2022)"]
["Ecoinvent","Coal","CO","Unknown",1288.8152684981371,"g/kWh","De-regionalized (Steubing et al 2022)"]
["Ecoinvent","Coal","CO","Unknown",1088.50877712833,"g/kWh","De-regionalized (Steubing et al 2022)"]
["Ecoinvent","Coal","CO","Unknown",1088.508777128329,"g/kWh","De-regionalized (Steubing et al 2022)"]
["Ecoinvent","Coal","CO","Unknown",1288.815268498136,"g/kWh","De-regionalized (Steubing et al 2022)"]
["Ecoinvent","Coal","CO","Unknown",1288.815268498136,"g/kWh","De-regionalized (Steubing et al 2022)"]
["Ecoinvent","Coal","CO","Unknown",1095.980235782809,"g/kWh","De-regionalized (Steubing et al 2022)"]
["Ecoinvent","Coal","CO","Unknown",1288.8152684981371,"g/kWh","De-regionalized (Steubing et al 2022)"]
["Ecoinvent","Coal","CO","Unknown",1088.508777128329,"g/kWh","De-regionalized (Steubing et al 2022)"]
["Ecoinvent","Coal","CO","Unknown",1288.287811962382,"g/kWh","De-regionalized (Steubing et al 2022)"]
["Ecoinvent","Coal","CO","Unknown",1288.28781196238,"g/kWh","De-regionalized (Steubing et al 2022)"]
["Ecoinvent","Coal","CO","Unknown",1088.50877712833,"g/kWh","De-regionalized (Steubing et al 2022)"]
["Ecoinvent","Coal","CO","Unknown",1230.648096887144,"g/kWh","De-regionalized (Steubing et al 2022)"]
["Ecoinvent","Coal","CO","Unknown",1145.094888292502,"g/kWh","De-regionalized (Steubing et al 2022)"]
["Ecoinvent","Coal","CO","Unknown",1633.767363780098,"g/kWh","De-regionalized (Steubing et al 2022)"]
["Ecoinvent","Coal","CO","Unknown",1294.554645597932,"g/kWh","De-regionalized (Steubing et al 2022)"]
["Ecoinvent","Coal","CO","Unknown",1286.9649456215539,"g/kWh","De-regionalized (Steubing et al 2022)"]
["Ecoinvent","Coal","CO","Unknown",1441.009595604407,"g/kWh","De-regionalized (Steubing et al 2022)"]
["Ecoinvent","Coal","CO","Unknown",1455.447101765645,"g/kWh","De-regionalized (Steubing et al 2022)"]
["Ecoinvent","Coal","CO","Unknown",1452.16051875593,"g/kWh","De-regionalized (Steubing et al 2022)"]
["Ecoinvent","Coal","CO","Unknown",1395.972891875441,"g/kWh","De-regionalized (Steubing et al 2022)"]
["Ecoinvent","Coal","CO","Unknown",1526.2392685778118,"g/kWh","De-regionalized (Steubing et al 2022)"]
["Ecoinvent","Coal","CO","Unknown",1497.090833080689,"g/kWh","De-regionalized (Steubing et al 2022)"]
["Ecoinvent","Coal","CO","Unknown",1808.657534085995,"g/kWh","De-regionalized (Steubing et al 2022)"]
["Ecoinvent","Coal","CO","Unknown",1443.761207522565,"g/kWh","De-regionalized (Steubing et al 2022)"]
["Ecoinvent","Coal","CO","Unknown",1389.585035122702,"g/kWh","De-regionalized (Steubing et al 2022)"]
["Ecoinvent","Coal","CO","Unknown",1926.1060566323772,"g/kWh","De-regionalized (Steubing et al 2022)"]
["Ecoinvent","Coal","CO","Unknown",1260.4324631099719,"g/kWh","De-regionalized (Steubing et al 2022)"]
["Ecoinvent","Coal","CO","Unknown",1387.783737201516,"g/kWh","De-regionalized (Steubing et al 2022)"]
["Ecoinvent","Coal","CO","Unknown",1641.523512464014,"g/kWh","De-regionalized (Steubing et al 2022)"]
["Ecoinvent","Coal","CO","Unknown",2044.069910279751,"g/kWh","De-regionalized (Steubing et al 2022)"]
["Ecoinvent","Coal","CO","Unknown",1594.07410171535,"g/kWh","De-regionalized (Steubing et al 2022)"]
["Ecoinvent","Coal","CO","Unknown",1576.494847096159,"g/kWh","De-regionalized (Steubing et al 2022)"]
["Ecoinvent","Coal","CO","Unknown",1372.4265717751061,"g/kWh","De-regionalized (Steubing et al 2022)"]
["Ecoinvent","Coal","CO","Unknown",1529.523696020327,"g/kWh","De-regionalized (Steubing et al 2022)"]
["Ecoinvent","Coal","CO","Unknown",1436.723841664395,"g/kWh","De-regionalized (Steubing et al 2022)"]
["Ecoinvent","Coal","CO","Unknown",1196.9964392907132,"g/kWh","De-regionalized (Steubing et al 2022)"]
["Ecoinvent","Coal","CO","Unknown",1570.016281897999,"g/kWh","De-regionalized (Steubing et al 2022)"]
["Ecoinvent","Coal","CO","Unknown",1401.821886124116,"g/kWh","De-regionalized (Steubing et al 2022)"]
["Ecoinvent","Coal","CO","Unknown",1496.991922007324,"g/kWh","De-regionalized (Steubing et al 2022)"]
["Ecoinvent","Coal","CO","Unknown",1480.107873111772,"g/kWh","De-regionalized (Steubing et al 2022)"]
["Ecoinvent","Coal","CO","Unknown",2068.080549886106,"g/kWh","De-regionalized (Steubing et al 2022)"]
["Ecoinvent","Coal","CO","Unknown",1198.9351469694288,"g/kWh","De-regionalized (Steubing et al 2022)"]
["Ecoinvent","Coal","CO","Unknown",1275.941932061138,"g/kWh","De-regionalized (Steubing et al 2022)"]
["Ecoinvent","Coal","CO","Unknown",1178.7828291758572,"g/kWh","De-regionalized (Steubing et al 2022)"]
["Ecoinvent","Coal","CO","Unknown",1765.518877266,"g/kWh","De-regionalized (Steubing et al 2022)"]
["Ecoinvent","Coal","CO","Unknown",1689.973394265667,"g/kWh","De-regionalized (Steubing et al 2022)"]
["Ecoinvent","Coal","CO","Unknown",1054.4613685670681,"g/kWh","De-regionalized (Steubing et al 2022)"]
["Ecoinvent","Coal","CO","Unknown",1205.255098490879,"g/kWh","De-regionalized (Steubing et al 2022)"]
["Ecoinvent","Coal","CO","Unknown",1095.170989214735,"g/kWh","De-regionalized (Steubing et al 2022)"]
["Ecoinvent","Coal","CO","Unknown",1100.5257793680162,"g/kWh","De-regionalized (Steubing et al 2022)"]
["Ecoinvent","Coal","CO","Unknown",1094.88585353198,"g/kWh","De-regionalized (Steubing et al 2022)"]
["Ecoinvent","Coal","CO","Unknown",1082.241479069837,"g/kWh","De-regionalized (Steubing et al 2022)"]
["Ecoinvent","Coal","CO","Unknown",1224.6353911764809,"g/kWh","De-regionalized (Steubing et al 2022)"]
["Ecoinvent","Coal","CO","Unknown",1166.942250859641,"g/kWh","De-regionalized (Steubing et al 2022)"]
["Ecoinvent","Coal","CO","Unknown",1159.387518236545,"g/kWh","De-regionalized (Steubing et al 2022)"]
["Ecoinvent","Coal","CO","Unknown",1301.6314818998048,"g/kWh","De-regionalized (Steubing et al 2022)"]
["Ecoinvent","Coal","CO","Unknown",1558.476611865118,"g/kWh","De-regionalized (Steubing et al 2022)"]
["Ecoinvent","Coal","CO","Unknown",1406.729297325673,"g/kWh","De-regionalized (Steubing et al 2022)"]
["Ecoinvent","Coal","CO","Unknown",1236.1568242900348,"g/kWh","De-regionalized (Steubing et al 2022)"]
["Ecoinvent","Coal","CO","Unknown",1195.244772102307,"g/kWh","De-regionalized (Steubing et al 2022)"]
["Ecoinvent","Coal","CO","Unknown",1269.031713341569,"g/kWh","De-regionalized (Steubing et al 2022)"]
["Ecoinvent","Coal","CO","Unknown",1732.903052592483,"g/kWh","De-regionalized (Steubing et al 2022)"]
["Ecoinvent","Coal","CO","Unknown",2261.898519344903,"g/kWh","De-regionalized (Steubing et al 2022)"]
["Ecoinvent","Coal","CO","Unknown",1732.903052592483,"g/kWh","De-regionalized (Steubing et al 2022)"]
["Ecoinvent","Coal","CO","Unknown",1853.1292616681728,"g/kWh","De-regionalized (Steubing et al 2022)"]
["Ecoinvent","Coal","CO","Unknown",1564.58624673787,"g/kWh","De-regionalized (Steubing et al 2022)"]
["Ecoinvent","Coal","CO","Unknown",1390.6561752411499,"g/kWh","De-regionalized (Steubing et al 2022)"]
["Ecoinvent","Coal","CO","Unknown",1684.812488558495,"g/kWh","De-regionalized (Steubing et al 2022)"]
["Ecoinvent","Coal","CO","Unknown",1805.038730463086,"g/kWh","De-regionalized (Steubing et al 2022)"]
["Ecoinvent","Coal","CO","Unknown",1660.767222757969,"g/kWh","De-regionalized (Steubing et al 2022)"]
["Ecoinvent","Coal","CO","Unknown",1756.94819878603,"g/kWh","De-regionalized (Steubing et al 2022)"]
["Ecoinvent","Coal","CO","Unknown",1901.21970638059,"g/kWh","De-regionalized (Steubing et al 2022)"]
["Ecoinvent","Coal","CO","Unknown",1756.94819878603,"g/kWh","De-regionalized (Steubing et al 2022)"]
["Ecoinvent","Coal","CO","Unknown",1588.63154441251,"g/kWh","De-regionalized (Steubing et al 2022)"]
["Ecoinvent","Coal","CO","Unknown",1612.6766915606602,"g/kWh","De-regionalized (Steubing et al 2022)"]
["Ecoinvent","Coal","CO","Unknown",1391.4557118815649,"g/kWh","De-regionalized (Steubing et al 2022)"]
["Ecoinvent","Coal","CO","Unknown",1732.903052592485,"g/kWh","De-regionalized (Steubing et al 2022)"]
["Ecoinvent","Coal","CO","Unknown",1391.4557118815649,"g/kWh","De-regionalized (Steubing et al 2022)"]
["Ecoinvent","Coal","CO","Unknown",1925.2649722565081,"g/kWh","De-regionalized (Steubing et al 2022)"]
["Ecoinvent","Coal","CO","Unknown",1660.767222757968,"g/kWh","De-regionalized (Steubing et al 2022)"]
["Ecoinvent","Coal","CO","Unknown",1412.745491794155,"g/kWh","De-regionalized (Steubing et al 2022)"]
["Ecoinvent","Coal","CO","Unknown",1102.192249620196,"g/kWh","De-regionalized (Steubing et al 2022)"]
["Ecoinvent","Coal","CO","Unknown",1148.907791863971,"g/kWh","De-regionalized (Steubing et al 2022)"]
["Ecoinvent","Coal","CO","Unknown",1149.442581582861,"g/kWh","De-regionalized (Steubing et al 2022)"]
["Ecoinvent","Coal","CO","Unknown",1258.511629998317,"g/kWh","De-regionalized (Steubing et al 2022)"]
["Ecoinvent","Coal","CO","Unknown",1067.293813128091,"g/kWh","De-regionalized (Steubing et al 2022)"]
["Ecoinvent","Coal","CO","Unknown",989.5161151431547,"g/kWh","De-regionalized (Steubing et al 2022)"]
["Ecoinvent","Coal","CO","Unknown",1189.024444801403,"g/kWh","De-regionalized (Steubing et al 2022)"]
["Ecoinvent","Coal","CO","Unknown",1026.960321818699,"g/kWh","De-regionalized (Steubing et al 2022)"]
["Ecoinvent","Coal","CO","Unknown",998.0240593839246,"g/kWh","De-regionalized (Steubing et al 2022)"]
["Ecoinvent","Coal","CO","Unknown",1489.9104333192179,"g/kWh","De-regionalized (Steubing et al 2022)"]
["Ecoinvent","Coal","CO","Unknown",1168.0064947452252,"g/kWh","De-regionalized (Steubing et al 2022)"]
["Ecoinvent","Coal","CO","Unknown",1154.992603292696,"g/kWh","De-regionalized (Steubing et al 2022)"]
["Ecoinvent","Coal","CO","Unknown",1136.581290328322,"g/kWh","De-regionalized (Steubing et al 2022)"]
["Ecoinvent","Coal","CO","Unknown",1138.195220501179,"g/kWh","De-regionalized (Steubing et al 2022)"]
["Ecoinvent","Coal","CO","Unknown",1236.1568242900369,"g/kWh","De-regionalized (Steubing et al 2022)"]
["Ecoinvent","Coal","CO","Unknown",973.3731719025973,"g/kWh","De-regionalized (Steubing et al 2022)"]
["Ecoinvent","Coal","CO","Unknown",1037.285928089512,"g/kWh","De-regionalized (Steubing et al 2022)"]
["Ecoinvent","Coal","CO","Unknown",1842.584025434715,"g/kWh","De-regionalized (Steubing et al 2022)"]
["Ecoinvent","Coal","CO","Unknown",1715.7282565222129,"g/kWh","De-regionalized (Steubing et al 2022)"]
["Ecoinvent","Coal","CO","Unknown",1492.220513968882,"g/kWh","De-regionalized (Steubing et al 2022)"]
["Ecoinvent","Coal","CO","Unknown",1544.2969911857222,"g/kWh","De-regionalized (Steubing et al 2022)"]
["Ecoinvent","Coal","CO","Unknown",1196.1205900860482,"g/kWh","De-regionalized (Steubing et al 2022)"]
["Ecoinvent","Coal","CO","Unknown",1245.862922031364,"g/kWh","De-regionalized (Steubing et al 2022)"]
["Ecoinvent","Coal","CO","Unknown",1177.167331185739,"g/kWh","De-regionalized (Steubing et al 2022)"]
["Ecoinvent","Coal","CO","Unknown",1136.013538090422,"g/kWh","De-regionalized (Steubing et al 2022)"]
["Ecoinvent","Coal","CO","Unknown",1151.9115769486139,"g/kWh","De-regionalized (Steubing et al 2022)"]
["Ecoinvent","Coal","CO","Unknown",1589.421687912751,"g/kWh","De-regionalized (Steubing et al 2022)"]
["Ecoinvent","Coal","CO","Unknown",1223.62208784783,"g/kWh","De-regionalized (Steubing et al 2022)"]
["Ecoinvent","Coal","CO","Unknown",1067.294140494419,"g/kWh","De-regionalized (Steubing et al 2022)"]
["Ecoinvent","Coal","CO","Unknown",1367.573324836065,"g/kWh","De-regionalized (Steubing et al 2022)"]
["Ecoinvent","Coal","CO","Unknown",1125.215316749718,"g/kWh","De-regionalized (Steubing et al 2022)"]
["Ecoinvent","Coal","CO","Unknown",1277.9865575368449,"g/kWh","De-regionalized (Steubing et al 2022)"]
["Ecoinvent","Coal","CO","Unknown",1258.51354638375,"g/kWh","De-regionalized (Steubing et al 2022)"]
["Ecoinvent","Coal","CO","Unknown",1245.9524536675099,"g/kWh","De-regionalized (Steubing et al 2022)"]
["Ecoinvent","Coal","CO","Unknown",1140.503694361238,"g/kWh","De-regionalized (Steubing et al 2022)"]
["Ecoinvent","Coal","CO","Unknown",1745.485258522842,"g/kWh","De-regionalized (Steubing et al 2022)"]
["Ecoinvent","Coal","CO","Unknown",1804.289767771374,"g/kWh","De-regionalized (Steubing et al 2022)"]
["Ecoinvent","Coal","CO","Unknown",1151.586842906595,"g/kWh","De-regionalized (Steubing et al 2022)"]
["Ecoinvent","Coal","CO","Unknown",1232.367643615438,"g/kWh","De-regionalized (Steubing et al 2022)"]
["Ecoinvent","Coal","CO","Unknown",1151.896722925288,"g/kWh","De-regionalized (Steubing et al 2022)"]
["Ecoinvent","Coal","CO","Unknown",1213.9260641354922,"g/kWh","De-regionalized (Steubing et al 2022)"]
["Ecoinvent","Coal","CO","Unknown",1214.6064306068681,"g/kWh","De-regionalized (Steubing et al 2022)"]
["Ecoinvent","Coal","CO","Unknown",1255.2582990009591,"g/kWh","De-regionalized (Steubing et al 2022)"]
["Ecoinvent","Coal","CO","Unknown",1165.83605142426,"g/kWh","De-regionalized (Steubing et al 2022)"]
["Ecoinvent","Coal","CO","Unknown",1247.533323387893,"g/kWh","De-regionalized (Steubing et al 2022)"]
["Ecoinvent","Coal","CO","Unknown",1145.382988221556,"g/kWh","De-regionalized (Steubing et al 2022)"]
["Ecoinvent","Coal","CO","Unknown",1221.2354705466219,"g/kWh","De-regionalized (Steubing et al 2022)"]
["Ecoinvent","Coal","CO","Unknown",1223.101995103943,"g/kWh","De-regionalized (Steubing et al 2022)"]
["Ecoinvent","Coal","CO","Unknown",1291.250337398711,"g/kWh","De-regionalized (Steubing et al 2022)"]
["Ecoinvent","Coal","CO","Unknown",1221.550291765028,"g/kWh","De-regionalized (Steubing et al 2022)"]
["Ecoinvent","Coal","CO","Unknown",1287.14859615951,"g/kWh","De-regionalized (Steubing et al 2022)"]
["Ecoinvent","Coal","CO","Unknown",1194.0293137951742,"g/kWh","De-regionalized (Steubing et al 2022)"]
["Ecoinvent","Coal","CO","Unknown",1239.90367963227,"g/kWh","De-regionalized (Steubing et al 2022)"]
["Ecoinvent","Coal","CO","Unknown",1002.2764786975121,"g/kWh","De-regionalized (Steubing et al 2022)"]
["Ecoinvent","Coal","CO","Unknown",1239.903679632274,"g/kWh","De-regionalized (Steubing et al 2022)"]
["Ecoinvent","Coal","CO","Unknown",1222.068340658744,"g/kWh","De-regionalized (Steubing et al 2022)"]
["Ecoinvent","Coal","CO","Unknown",1421.197560496778,"g/kWh","De-regionalized (Steubing et al 2022)"]
["Ecoinvent","Coal","CO","Unknown",1360.402948401551,"g/kWh","De-regionalized (Steubing et al 2022)"]
["Ecoinvent","Coal","CO","Unknown",1051.5495534559561,"g/kWh","De-regionalized (Steubing et al 2022)"]
["Ecoinvent","Coal","CO","Unknown",1351.79174756316,"g/kWh","De-regionalized (Steubing et al 2022)"]
["Ecoinvent","Coal","CO","Unknown",1311.071789893319,"g/kWh","De-regionalized (Steubing et al 2022)"]
["Ecoinvent","Coal","CO","Unknown",1236.1568242900369,"g/kWh","De-regionalized (Steubing et al 2022)"]
["Ecoinvent","Coal","CO","Unknown",1447.367815084498,"g/kWh","De-regionalized (Steubing et al 2022)"]
["Ecoinvent","Coal","CO","Unknown",1343.959091195175,"g/kWh","De-regionalized (Steubing et al 2022)"]
["Ecoinvent","Coal","CO","Unknown",1236.1568242900369,"g/kWh","De-regionalized (Steubing et al 2022)"]
["Ecoinvent","Coal","CO","Unknown",1500.621587282712,"g/kWh","De-regionalized (Steubing et al 2022)"]
["Ecoinvent","Coal","CO","Unknown",1584.312384029825,"g/kWh","De-regionalized (Steubing et al 2022)"]
["Ecoinvent","Coal","CO","Unknown",1258.511629998315,"g/kWh","De-regionalized (Steubing et al 2022)"]
["Ecoinvent","Natural Gas","NG","Unknown",418.661250748591,"g/kWh","De-regionalized (Steubing et al 2022)"]
["Ecoinvent","Natural Gas","NG","Unknown",695.7311201077538,"g/kWh","De-regionalized (Steubing et al 2022)"]
["Ecoinvent","Natural Gas","NG","Unknown",541.9747298536196,"g/kWh","De-regionalized (Steubing et al 2022)"]
["Ecoinvent","Natural Gas","NG","Unknown",512.4316618172993,"g/kWh","De-regionalized (Steubing et al 2022)"]
["Ecoinvent","Natural Gas","NG","Unknown",506.8609817370906,"g/kWh","De-regionalized (Steubing et al 2022)"]
["Ecoinvent","Natural Gas","NG","Unknown",840.9593731305745,"g/kWh","De-regionalized (Steubing et al 2022)"]
["Ecoinvent","Natural Gas","NG","Unknown",533.7983522288328,"g/kWh","De-regionalized (Steubing et al 2022)"]
["Ecoinvent","Natural Gas","NG","Unknown",765.3495367573821,"g/kWh","De-regionalized (Steubing et al 2022)"]
["Ecoinvent","Natural Gas","NG","Unknown",413.2413613237276,"g/kWh","De-regionalized (Steubing et al 2022)"]
["Ecoinvent","Natural Gas","NG","Unknown",724.2752141175936,"g/kWh","De-regionalized (Steubing et al 2022)"]
["Ecoinvent","Natural Gas","NG","Unknown",423.0911495370535,"g/kWh","De-regionalized (Steubing et al 2022)"]
["Ecoinvent","Natural Gas","NG","Unknown",558.7761639058635,"g/kWh","De-regionalized (Steubing et al 2022)"]
["Ecoinvent","Natural Gas","NG","Unknown",387.1333448193944,"g/kWh","De-regionalized (Steubing et al 2022)"]
["Ecoinvent","Natural Gas","NG","Unknown",562.6067577696609,"g/kWh","De-regionalized (Steubing et al 2022)"]
["Ecoinvent","Natural Gas","NG","Unknown",457.7329219401905,"g/kWh","De-regionalized (Steubing et al 2022)"]
["Ecoinvent","Natural Gas","NG","Unknown",614.8243424756189,"g/kWh","De-regionalized (Steubing et al 2022)"]
["Ecoinvent","Natural Gas","NG","Unknown",386.9942758749752,"g/kWh","De-regionalized (Steubing et al 2022)"]
["Ecoinvent","Natural Gas","NG","Unknown",745.4395015006996,"g/kWh","De-regionalized (Steubing et al 2022)"]
["Ecoinvent","Natural Gas","NG","Unknown",602.4927425059075,"g/kWh","De-regionalized (Steubing et al 2022)"]
["Ecoinvent","Natural Gas","NG","Unknown",969.2910045879721,"g/kWh","De-regionalized (Steubing et al 2022)"]
["Ecoinvent","Natural Gas","NG","Unknown",432.2432613346459,"g/kWh","De-regionalized (Steubing et al 2022)"]
["Ecoinvent","Natural Gas","NG","Unknown",719.0194012338219,"g/kWh","De-regionalized (Steubing et al 2022)"]
["Ecoinvent","Natural Gas","NG","Unknown",557.1268565013705,"g/kWh","De-regionalized (Steubing et al 2022)"]
["Ecoinvent","Natural Gas","NG","Unknown",209.3190707104352,"g/kWh","De-regionalized (Steubing et al 2022)"]
["Ecoinvent","Natural Gas","NG","Unknown",438.10510877960303,"g/kWh","De-regionalized (Steubing et al 2022)"]
["Ecoinvent","Natural Gas","NG","Unknown",728.7299366773282,"g/kWh","De-regionalized (Steubing et al 2022)"]
["Ecoinvent","Natural Gas","NG","Unknown",564.6509928286229,"g/kWh","De-regionalized (Steubing et al 2022)"]
["Ecoinvent","Natural Gas","NG","Unknown",438.1051087796027,"g/kWh","De-regionalized (Steubing et al 2022)"]
["Ecoinvent","Natural Gas","NG","Unknown",728.729936677328,"g/kWh","De-regionalized (Steubing et al 2022)"]
["Ecoinvent","Natural Gas","NG","Unknown",578.9638365147808,"g/kWh","De-regionalized (Steubing et al 2022)"]
["Ecoinvent","Natural Gas","NG","Unknown",438.1051087796028,"g/kWh","De-regionalized (Steubing et al 2022)"]
["Ecoinvent","Natural Gas","NG","Unknown",728.7299366773285,"g/kWh","De-regionalized (Steubing et al 2022)"]
["Ecoinvent","Natural Gas","NG","Unknown",564.6509928286227,"g/kWh","De-regionalized (Steubing et al 2022)"]
["Ecoinvent","Natural Gas","NG","Unknown",728.7299366773285,"g/kWh","De-regionalized (Steubing et al 2022)"]
["Ecoinvent","Natural Gas","NG","Unknown",438.1051087796033,"g/kWh","De-regionalized (Steubing et al 2022)"]
["Ecoinvent","Natural Gas","NG","Unknown",728.7299366773283,"g/kWh","De-regionalized (Steubing et al 2022)"]
["Ecoinvent","Natural Gas","NG","Unknown",578.9638365147806,"g/kWh","De-regionalized (Steubing et al 2022)"]
["Ecoinvent","Natural Gas","NG","Unknown",438.10510877960314,"g/kWh","De-regionalized (Steubing et al 2022)"]
["Ecoinvent","Natural Gas","NG","Unknown",728.7299366773283,"g/kWh","De-regionalized (Steubing et al 2022)"]
["Ecoinvent","Natural Gas","NG","Unknown",564.6509928286224,"g/kWh","De-regionalized (Steubing et al 2022)"]
["Ecoinvent","Natural Gas","NG","Unknown",438.10510877960303,"g/kWh","De-regionalized (Steubing et al 2022)"]
["Ecoinvent","Natural Gas","NG","Unknown",728.7299366773285,"g/kWh","De-regionalized (Steubing et al 2022)"]
["Ecoinvent","Natural Gas","NG","Unknown",564.6509928286218,"g/kWh","De-regionalized (Steubing et al 2022)"]
["Ecoinvent","Natural Gas","NG","Unknown",599.5368330738567,"g/kWh","De-regionalized (Steubing et al 2022)"]
["Ecoinvent","Natural Gas","NG","Unknown",578.9638365147806,"g/kWh","De-regionalized (Steubing et al 2022)"]
["Ecoinvent","Natural Gas","NG","Unknown",707.2664863456597,"g/kWh","De-regionalized (Steubing et al 2022)"]
["Ecoinvent","Natural Gas","NG","Unknown",395.6758789106899,"g/kWh","De-regionalized (Steubing et al 2022)"]
["Ecoinvent","Natural Gas","NG","Unknown",438.1051087796034,"g/kWh","De-regionalized (Steubing et al 2022)"]
["Ecoinvent","Natural Gas","NG","Unknown",728.7299366773286,"g/kWh","De-regionalized (Steubing et al 2022)"]
["Ecoinvent","Natural Gas","NG","Unknown",564.6509928286224,"g/kWh","De-regionalized (Steubing et al 2022)"]
["Ecoinvent","Natural Gas","NG","Unknown",566.8029141437178,"g/kWh","De-regionalized (Steubing et al 2022)"]
["Ecoinvent","Natural Gas","NG","Unknown",569.0723774414492,"g/kWh","De-regionalized (Steubing et al 2022)"]
["Ecoinvent","Natural Gas","NG","Unknown",531.3777194155525,"g/kWh","De-regionalized (Steubing et al 2022)"]
["Ecoinvent","Natural Gas","NG","Unknown",533.5053411243072,"g/kWh","De-regionalized (Steubing et al 2022)"]
["Ecoinvent","Natural Gas","NG","Unknown",762.2522117599435,"g/kWh","De-regionalized (Steubing et al 2022)"]
["Ecoinvent","Natural Gas","NG","Unknown",765.3042484714974,"g/kWh","De-regionalized (Steubing et al 2022)"]
["Ecoinvent","Natural Gas","NG","Unknown",597.44088539516,"g/kWh","De-regionalized (Steubing et al 2022)"]
["Ecoinvent","Natural Gas","NG","Unknown",599.8330224042013,"g/kWh","De-regionalized (Steubing et al 2022)"]
["Ecoinvent","Natural Gas","NG","Unknown",597.4408853951609,"g/kWh","De-regionalized (Steubing et al 2022)"]
["Ecoinvent","Natural Gas","NG","Unknown",599.8330224042013,"g/kWh","De-regionalized (Steubing et al 2022)"]
["Ecoinvent","Natural Gas","NG","Unknown",669.8579875289194,"g/kWh","De-regionalized (Steubing et al 2022)"]
["Ecoinvent","Natural Gas","NG","Unknown",672.5400805371823,"g/kWh","De-regionalized (Steubing et al 2022)"]
["Ecoinvent","Natural Gas","NG","Unknown",669.8579875289201,"g/kWh","De-regionalized (Steubing et al 2022)"]
["Ecoinvent","Natural Gas","NG","Unknown",672.5400805371825,"g/kWh","De-regionalized (Steubing et al 2022)"]
["Ecoinvent","Natural Gas","NG","Unknown",669.8579875289184,"g/kWh","De-regionalized (Steubing et al 2022)"]
["Ecoinvent","Natural Gas","NG","Unknown",672.5400805371836,"g/kWh","De-regionalized (Steubing et al 2022)"]
["Ecoinvent","Natural Gas","NG","Unknown",650.1562640403357,"g/kWh","De-regionalized (Steubing et al 2022)"]
["Ecoinvent","Natural Gas","NG","Unknown",652.7594716554042,"g/kWh","De-regionalized (Steubing et al 2022)"]
["Ecoinvent","Natural Gas","NG","Unknown",713.0746430064887,"g/kWh","De-regionalized (Steubing et al 2022)"]
["Ecoinvent","Natural Gas","NG","Unknown",715.9297740901277,"g/kWh","De-regionalized (Steubing et al 2022)"]
["Ecoinvent","Natural Gas","NG","Unknown",690.7910740855458,"g/kWh","De-regionalized (Steubing et al 2022)"]
["Ecoinvent","Natural Gas","NG","Unknown",693.5569822034339,"g/kWh","De-regionalized (Steubing et al 2022)"]
["Ecoinvent","Natural Gas","NG","Unknown",850.204339356808,"g/kWh","De-regionalized (Steubing et al 2022)"]
["Ecoinvent","Natural Gas","NG","Unknown",853.6085338764386,"g/kWh","De-regionalized (Steubing et al 2022)"]
["Ecoinvent","Natural Gas","NG","Unknown",669.8579875289182,"g/kWh","De-regionalized (Steubing et al 2022)"]
["Ecoinvent","Natural Gas","NG","Unknown",672.5400805371827,"g/kWh","De-regionalized (Steubing et al 2022)"]
["Ecoinvent","Natural Gas","NG","Unknown",650.1562640403362,"g/kWh","De-regionalized (Steubing et al 2022)"]
["Ecoinvent","Natural Gas","NG","Unknown",652.7594716554042,"g/kWh","De-regionalized (Steubing et al 2022)"]
["Ecoinvent","Natural Gas","NG","Unknown",884.2125396989913,"g/kWh","De-regionalized (Steubing et al 2022)"]
["Ecoinvent","Natural Gas","NG","Unknown",887.7529024032256,"g/kWh","De-regionalized (Steubing et al 2022)"]
["Ecoinvent","Natural Gas","NG","Unknown",581.7187575456096,"g/kWh","De-regionalized (Steubing et al 2022)"]
["Ecoinvent","Natural Gas","NG","Unknown",584.0479432573991,"g/kWh","De-regionalized (Steubing et al 2022)"]
["Ecoinvent","Natural Gas","NG","Unknown",650.1562640403356,"g/kWh","De-regionalized (Steubing et al 2022)"]
["Ecoinvent","Natural Gas","NG","Unknown",652.759471655404,"g/kWh","De-regionalized (Steubing et al 2022)"]
["Ecoinvent","Natural Gas","NG","Unknown",762.2522117599435,"g/kWh","De-regionalized (Steubing et al 2022)"]
["Ecoinvent","Natural Gas","NG","Unknown",765.3042484714969,"g/kWh","De-regionalized (Steubing et al 2022)"]
["Ecoinvent","Natural Gas","NG","Unknown",961.1006002746863,"g/kWh","De-regionalized (Steubing et al 2022)"]
["Ecoinvent","Natural Gas","NG","Unknown",964.9488205277677,"g/kWh","De-regionalized (Steubing et al 2022)"]
["Ecoinvent","Natural Gas","NG","Unknown",736.8437845827958,"g/kWh","De-regionalized (Steubing et al 2022)"]
["Ecoinvent","Natural Gas","NG","Unknown",739.7940868055471,"g/kWh","De-regionalized (Steubing et al 2022)"]
["Ecoinvent","Natural Gas","NG","Unknown",736.843784582796,"g/kWh","De-regionalized (Steubing et al 2022)"]
["Ecoinvent","Natural Gas","NG","Unknown",739.7940868055479,"g/kWh","De-regionalized (Steubing et al 2022)"]
["Ecoinvent","Natural Gas","NG","Unknown",631.5804049978567,"g/kWh","De-regionalized (Steubing et al 2022)"]
["Ecoinvent","Natural Gas","NG","Unknown",634.1092353969875,"g/kWh","De-regionalized (Steubing et al 2022)"]
["Ecoinvent","Natural Gas","NG","Unknown",713.0746430064875,"g/kWh","De-regionalized (Steubing et al 2022)"]
["Ecoinvent","Natural Gas","NG","Unknown",715.9297740901277,"g/kWh","De-regionalized (Steubing et al 2022)"]
["Ecoinvent","Natural Gas","NG","Unknown",669.8579875289183,"g/kWh","De-regionalized (Steubing et al 2022)"]
["Ecoinvent","Natural Gas","NG","Unknown",672.5400805371826,"g/kWh","De-regionalized (Steubing et al 2022)"]
["Ecoinvent","Natural Gas","NG","Unknown",552.6328363743031,"g/kWh","De-regionalized (Steubing et al 2022)"]
["Ecoinvent","Natural Gas","NG","Unknown",554.8455629845064,"g/kWh","De-regionalized (Steubing et al 2022)"]
["Ecoinvent","Natural Gas","NG","Unknown",736.843784582796,"g/kWh","De-regionalized (Steubing et al 2022)"]
["Ecoinvent","Natural Gas","NG","Unknown",739.7940868055473,"g/kWh","De-regionalized (Steubing et al 2022)"]
["Ecoinvent","Natural Gas","NG","Unknown",650.1562640403349,"g/kWh","De-regionalized (Steubing et al 2022)"]
["Ecoinvent","Natural Gas","NG","Unknown",652.7594716554039,"g/kWh","De-regionalized (Steubing et al 2022)"]
["Ecoinvent","Natural Gas","NG","Unknown",690.7910740855457,"g/kWh","De-regionalized (Steubing et al 2022)"]
["Ecoinvent","Natural Gas","NG","Unknown",693.5569822034333,"g/kWh","De-regionalized (Steubing et al 2022)"]
["Ecoinvent","Natural Gas","NG","Unknown",678.0770970631809,"g/kWh","De-regionalized (Steubing et al 2022)"]
["Ecoinvent","Natural Gas","NG","Unknown",680.7920992272268,"g/kWh","De-regionalized (Steubing et al 2022)"]
["Ecoinvent","Natural Gas","NG","Unknown",961.1006002746858,"g/kWh","De-regionalized (Steubing et al 2022)"]
["Ecoinvent","Natural Gas","NG","Unknown",964.948820527768,"g/kWh","De-regionalized (Steubing et al 2022)"]
["Ecoinvent","Natural Gas","NG","Unknown",552.6328363743029,"g/kWh","De-regionalized (Steubing et al 2022)"]
["Ecoinvent","Natural Gas","NG","Unknown",554.8455629845062,"g/kWh","De-regionalized (Steubing et al 2022)"]
["Ecoinvent","Natural Gas","NG","Unknown",476.9974815917569,"g/kWh","De-regionalized (Steubing et al 2022)"]
["Ecoinvent","Natural Gas","NG","Unknown",749.0018612216588,"g/kWh","De-regionalized (Steubing et al 2022)"]
["Ecoinvent","Natural Gas","NG","Unknown",886.7593289724751,"g/kWh","De-regionalized (Steubing et al 2022)"]
["Ecoinvent","Natural Gas","NG","Unknown",449.0481707753468,"g/kWh","De-regionalized (Steubing et al 2022)"]
["Ecoinvent","Natural Gas","NG","Unknown",512.985094272888,"g/kWh","De-regionalized (Steubing et al 2022)"]
["Ecoinvent","Natural Gas","NG","Unknown",567.188877880645,"g/kWh","De-regionalized (Steubing et al 2022)"]
["Ecoinvent","Natural Gas","NG","Unknown",835.0999942651032,"g/kWh","De-regionalized (Steubing et al 2022)"]
["Ecoinvent","Natural Gas","NG","Unknown",884.1090050749619,"g/kWh","De-regionalized (Steubing et al 2022)"]
["Ecoinvent","Natural Gas","NG","Unknown",431.54457840940654,"g/kWh","De-regionalized (Steubing et al 2022)"]
["Ecoinvent","Natural Gas","NG","Unknown",569.7568894639732,"g/kWh","De-regionalized (Steubing et al 2022)"]
["Ecoinvent","Natural Gas","NG","Unknown",550.0905925782034,"g/kWh","De-regionalized (Steubing et al 2022)"]
["Ecoinvent","Natural Gas","NG","Unknown",786.9087281805948,"g/kWh","De-regionalized (Steubing et al 2022)"]
["Ecoinvent","Natural Gas","NG","Unknown",703.5867280678558,"g/kWh","De-regionalized (Steubing et al 2022)"]
["Ecoinvent","Natural Gas","NG","Unknown",753.3499208607908,"g/kWh","De-regionalized (Steubing et al 2022)"]
["Ecoinvent","Natural Gas","NG","Unknown",424.1806813257034,"g/kWh","De-regionalized (Steubing et al 2022)"]
["Ecoinvent","Natural Gas","NG","Unknown",710.09750966948,"g/kWh","De-regionalized (Steubing et al 2022)"]
["Ecoinvent","Natural Gas","NG","Unknown",416.647688871622,"g/kWh","De-regionalized (Steubing et al 2022)"]
["Ecoinvent","Natural Gas","NG","Unknown",550.2488421047357,"g/kWh","De-regionalized (Steubing et al 2022)"]
["Ecoinvent","Natural Gas","NG","Unknown",753.3499208607902,"g/kWh","De-regionalized (Steubing et al 2022)"]
["Ecoinvent","Natural Gas","NG","Unknown",602.2129553016312,"g/kWh","De-regionalized (Steubing et al 2022)"]
["Ecoinvent","Natural Gas","NG","Unknown",942.8248994143192,"g/kWh","De-regionalized (Steubing et al 2022)"]
["Ecoinvent","Natural Gas","NG","Unknown",518.9885860556113,"g/kWh","De-regionalized (Steubing et al 2022)"]
["Ecoinvent","Natural Gas","NG","Unknown",624.1495787638187,"g/kWh","De-regionalized (Steubing et al 2022)"]
["Ecoinvent","Natural Gas","NG","Unknown",595.8873246363622,"g/kWh","De-regionalized (Steubing et al 2022)"]
["Ecoinvent","Natural Gas","NG","Unknown",990.8489244806473,"g/kWh","De-regionalized (Steubing et al 2022)"]
["Ecoinvent","Natural Gas","NG","Unknown",635.2927019308227,"g/kWh","De-regionalized (Steubing et al 2022)"]
["Ecoinvent","Natural Gas","NG","Unknown",667.3642747899136,"g/kWh","De-regionalized (Steubing et al 2022)"]
["Ecoinvent","Natural Gas","NG","Unknown",719.3968948334522,"g/kWh","De-regionalized (Steubing et al 2022)"]
["Ecoinvent","Natural Gas","NG","Unknown",836.9847195680388,"g/kWh","De-regionalized (Steubing et al 2022)"]
["Ecoinvent","Natural Gas","NG","Unknown",539.1932941899674,"g/kWh","De-regionalized (Steubing et al 2022)"]
["Ecoinvent","Natural Gas","NG","Unknown",689.4314680812379,"g/kWh","De-regionalized (Steubing et al 2022)"]
["Ecoinvent","Natural Gas","NG","Unknown",509.7048744951046,"g/kWh","De-regionalized (Steubing et al 2022)"]
["Ecoinvent","Natural Gas","NG","Unknown",511.6812213047302,"g/kWh","De-regionalized (Steubing et al 2022)"]
["Ecoinvent","Natural Gas","NG","Unknown",789.3097918629597,"g/kWh","De-regionalized (Steubing et al 2022)"]
["Ecoinvent","Natural Gas","NG","Unknown",792.370288024021,"g/kWh","De-regionalized (Steubing et al 2022)"]
["Ecoinvent","Natural Gas","NG","Unknown",536.2285190272864,"g/kWh","De-regionalized (Steubing et al 2022)"]
["Ecoinvent","Natural Gas","NG","Unknown",541.5245698277407,"g/kWh","De-regionalized (Steubing et al 2022)"]
["Ecoinvent","Natural Gas","NG","Unknown",509.06384326611595,"g/kWh","De-regionalized (Steubing et al 2022)"]
["Ecoinvent","Natural Gas","NG","Unknown",511.03770442388276,"g/kWh","De-regionalized (Steubing et al 2022)"]
["Ecoinvent","Natural Gas","NG","Unknown",491.0194302060885,"g/kWh","De-regionalized (Steubing et al 2022)"]
["Ecoinvent","Natural Gas","NG","Unknown",492.9233254778563,"g/kWh","De-regionalized (Steubing et al 2022)"]
["Ecoinvent","Natural Gas","NG","Unknown",498.1382507288404,"g/kWh","De-regionalized (Steubing et al 2022)"]
["Ecoinvent","Natural Gas","NG","Unknown",517.980007047212,"g/kWh","De-regionalized (Steubing et al 2022)"]
["Ecoinvent","Natural Gas","NG","Unknown",691.297361304677,"g/kWh","De-regionalized (Steubing et al 2022)"]
["Ecoinvent","Natural Gas","NG","Unknown",693.9778209920684,"g/kWh","De-regionalized (Steubing et al 2022)"]
["Ecoinvent","Natural Gas","NG","Unknown",535.8795510534331,"g/kWh","De-regionalized (Steubing et al 2022)"]
["Ecoinvent","Natural Gas","NG","Unknown",537.957388466306,"g/kWh","De-regionalized (Steubing et al 2022)"]
["Ecoinvent","Natural Gas","NG","Unknown",735.8557690312821,"g/kWh","De-regionalized (Steubing et al 2022)"]
["Ecoinvent","Natural Gas","NG","Unknown",738.7090005471385,"g/kWh","De-regionalized (Steubing et al 2022)"]
["Ecoinvent","Natural Gas","NG","Unknown",543.0014461642563,"g/kWh","De-regionalized (Steubing et al 2022)"]
["Ecoinvent","Natural Gas","NG","Unknown",545.1068982228179,"g/kWh","De-regionalized (Steubing et al 2022)"]
["Ecoinvent","Natural Gas","NG","Unknown",541.5481794950899,"g/kWh","De-regionalized (Steubing et al 2022)"]
["Ecoinvent","Natural Gas","NG","Unknown",543.6479965713406,"g/kWh","De-regionalized (Steubing et al 2022)"]
["Ecoinvent","Natural Gas","NG","Unknown",939.1353332282347,"g/kWh","De-regionalized (Steubing et al 2022)"]
["Ecoinvent","Natural Gas","NG","Unknown",942.7767680253698,"g/kWh","De-regionalized (Steubing et al 2022)"]
["Ecoinvent","Natural Gas","NG","Unknown",527.7404817362499,"g/kWh","De-regionalized (Steubing et al 2022)"]
["Ecoinvent","Natural Gas","NG","Unknown",529.7867602976103,"g/kWh","De-regionalized (Steubing et al 2022)"]
["Ecoinvent","Natural Gas","NG","Unknown",517.6888482224718,"g/kWh","De-regionalized (Steubing et al 2022)"]
["Ecoinvent","Natural Gas","NG","Unknown",877.2262112595123,"g/kWh","De-regionalized (Steubing et al 2022)"]
["Ecoinvent","Natural Gas","NG","Unknown",377.8973977951917,"g/kWh","De-regionalized (Steubing et al 2022)"]
["Ecoinvent","Natural Gas","NG","Unknown",639.4582327349212,"g/kWh","De-regionalized (Steubing et al 2022)"]
["Ecoinvent","Natural Gas","NG","Unknown",465.457700663212,"g/kWh","De-regionalized (Steubing et al 2022)"]
["Ecoinvent","Natural Gas","NG","Unknown",464.56896135283523,"g/kWh","De-regionalized (Steubing et al 2022)"]
["Ecoinvent","Natural Gas","NG","Unknown",782.8589694194972,"g/kWh","De-regionalized (Steubing et al 2022)"]
["Ecoinvent","Natural Gas","NG","Unknown",506.0887697065989,"g/kWh","De-regionalized (Steubing et al 2022)"]
["Ecoinvent","Natural Gas","NG","Unknown",695.458490910682,"g/kWh","De-regionalized (Steubing et al 2022)"]
["Ecoinvent","Natural Gas","NG","Unknown",480.32435938905996,"g/kWh","De-regionalized (Steubing et al 2022)"]
["Ecoinvent","Natural Gas","NG","Unknown",758.6882878468899,"g/kWh","De-regionalized (Steubing et al 2022)"]
["Ecoinvent","Natural Gas","NG","Unknown",386.99427587497496,"g/kWh","De-regionalized (Steubing et al 2022)"]
["Ecoinvent","Natural Gas","NG","Unknown",520.4586846191999,"g/kWh","De-regionalized (Steubing et al 2022)"]
["Ecoinvent","Natural Gas","NG","Unknown",752.5427986143726,"g/kWh","De-regionalized (Steubing et al 2022)"]
["Ecoinvent","Natural Gas","NG","Unknown",489.8850977380593,"g/kWh","De-regionalized (Steubing et al 2022)"]
["Ecoinvent","Natural Gas","NG","Unknown",640.6921318381769,"g/kWh","De-regionalized (Steubing et al 2022)"]
["Ecoinvent","Natural Gas","NG","Unknown",386.9942758749751,"g/kWh","De-regionalized (Steubing et al 2022)"]
["Ecoinvent","Natural Gas","NG","Unknown",444.0228636718823,"g/kWh","De-regionalized (Steubing et al 2022)"]
["Ecoinvent","Natural Gas","NG","Unknown",703.3357452217052,"g/kWh","De-regionalized (Steubing et al 2022)"]
["Ecoinvent","Natural Gas","NG","Unknown",438.597488636403,"g/kWh","De-regionalized (Steubing et al 2022)"]
["Ecoinvent","Natural Gas","NG","Unknown",684.9944910323186,"g/kWh","De-regionalized (Steubing et al 2022)"]
["Ecoinvent","Natural Gas","NG","Unknown",705.9503055727228,"g/kWh","De-regionalized (Steubing et al 2022)"]
["Ecoinvent","Natural Gas","NG","Unknown",374.2244016658329,"g/kWh","De-regionalized (Steubing et al 2022)"]
["Ecoinvent","Natural Gas","NG","Unknown",644.2260805704944,"g/kWh","De-regionalized (Steubing et al 2022)"]
["Ecoinvent","Natural Gas","NG","Unknown",394.0285143789676,"g/kWh","De-regionalized (Steubing et al 2022)"]
["Ecoinvent","Natural Gas","NG","Unknown",520.5263799810959,"g/kWh","De-regionalized (Steubing et al 2022)"]
["Ecoinvent","Natural Gas","NG","Unknown",705.9503055727236,"g/kWh","De-regionalized (Steubing et al 2022)"]
["Ecoinvent","Natural Gas","NG","Unknown",347.1968310549259,"g/kWh","De-regionalized (Steubing et al 2022)"]
["Ecoinvent","Natural Gas","NG","Unknown",483.0469764504926,"g/kWh","De-regionalized (Steubing et al 2022)"]
["Ecoinvent","Natural Gas","NG","Unknown",499.9416179688685,"g/kWh","De-regionalized (Steubing et al 2022)"]
["Ecoinvent","Natural Gas","NG","Unknown",559.6244291827965,"g/kWh","De-regionalized (Steubing et al 2022)"]
["Ecoinvent","Natural Gas","NG","Unknown",677.1376756091267,"g/kWh","De-regionalized (Steubing et al 2022)"]
["Ecoinvent","Natural Gas","NG","Unknown",386.9942758749751,"g/kWh","De-regionalized (Steubing et al 2022)"]
["Ecoinvent","Natural Gas","NG","Unknown",491.8950787556636,"g/kWh","De-regionalized (Steubing et al 2022)"]
["Ecoinvent","Natural Gas","NG","Unknown",692.9830026484126,"g/kWh","De-regionalized (Steubing et al 2022)"]
["Ecoinvent","Natural Gas","NG","Unknown",441.3223099497635,"g/kWh","De-regionalized (Steubing et al 2022)"]
["Ecoinvent","Natural Gas","NG","Unknown",722.8504432746585,"g/kWh","De-regionalized (Steubing et al 2022)"]
["Ecoinvent","Natural Gas","NG","Unknown",266.4071087129616,"g/kWh","De-regionalized (Steubing et al 2022)"]
["Ecoinvent","Natural Gas","NG","Unknown",613.6579148968408,"g/kWh","De-regionalized (Steubing et al 2022)"]
["Ecoinvent","Natural Gas","NG","Unknown",386.99427587497496,"g/kWh","De-regionalized (Steubing et al 2022)"]
["Ecoinvent","Natural Gas","NG","Unknown",614.7954778910314,"g/kWh","De-regionalized (Steubing et al 2022)"]
["Ecoinvent","Natural Gas","NG","Unknown",462.1372680000805,"g/kWh","De-regionalized (Steubing et al 2022)"]
["Ecoinvent","Natural Gas","NG","Unknown",703.5475359302455,"g/kWh","De-regionalized (Steubing et al 2022)"]
["Ecoinvent","Natural Gas","NG","Unknown",419.754761476556,"g/kWh","De-regionalized (Steubing et al 2022)"]
["Ecoinvent","Natural Gas","NG","Unknown",1571.067087450484,"g/kWh","De-regionalized (Steubing et al 2022)"]
["Ecoinvent","Natural Gas","NG","Unknown",552.7869715915419,"g/kWh","De-regionalized (Steubing et al 2022)"]
["Ecoinvent","Natural Gas","NG","Unknown",857.7686615004645,"g/kWh","De-regionalized (Steubing et al 2022)"]
["Ecoinvent","Natural Gas","NG","Unknown",784.6851591156216,"g/kWh","De-regionalized (Steubing et al 2022)"]
["Ecoinvent","Natural Gas","NG","Unknown",547.5766316628368,"g/kWh","De-regionalized (Steubing et al 2022)"]
["Ecoinvent","Natural Gas","NG","Unknown",887.4616090979839,"g/kWh","De-regionalized (Steubing et al 2022)"]
["Ecoinvent","Natural Gas","NG","Unknown",613.8402875750803,"g/kWh","De-regionalized (Steubing et al 2022)"]
["Ecoinvent","Natural Gas","NG","Unknown",815.2242905900397,"g/kWh","De-regionalized (Steubing et al 2022)"]
["Ecoinvent","Natural Gas","NG","Unknown",386.9942758749753,"g/kWh","De-regionalized (Steubing et al 2022)"]
["Ecoinvent","Natural Gas","NG","Unknown",1094.223142789571,"g/kWh","De-regionalized (Steubing et al 2022)"]
["Ecoinvent","Natural Gas","NG","Unknown",566.5265904481118,"g/kWh","De-regionalized (Steubing et al 2022)"]
["Ecoinvent","Natural Gas","NG","Unknown",421.05358203598706,"g/kWh","De-regionalized (Steubing et al 2022)"]
["Ecoinvent","Natural Gas","NG","Unknown",693.5569822034347,"g/kWh","De-regionalized (Steubing et al 2022)"]
["Ecoinvent","Natural Gas","NG","Unknown",495.1808861984058,"g/kWh","De-regionalized (Steubing et al 2022)"]
["Ecoinvent","Natural Gas","NG","Unknown",549.7208439851863,"g/kWh","De-regionalized (Steubing et al 2022)"]
["Ecoinvent","Natural Gas","NG","Unknown",483.2054467196852,"g/kWh","De-regionalized (Steubing et al 2022)"]
["Ecoinvent","Natural Gas","NG","Unknown",776.5187879184042,"g/kWh","De-regionalized (Steubing et al 2022)"]
["Ecoinvent","Natural Gas","NG","Unknown",445.3583696843802,"g/kWh","De-regionalized (Steubing et al 2022)"]
["Ecoinvent","Natural Gas","NG","Unknown",535.8730530756696,"g/kWh","De-regionalized (Steubing et al 2022)"]
["Ecoinvent","Natural Gas","NG","Unknown",372.022524213118,"g/kWh","De-regionalized (Steubing et al 2022)"]
["Ecoinvent","Natural Gas","NG","Unknown",613.6856264889745,"g/kWh","De-regionalized (Steubing et al 2022)"]
["Ecoinvent","Natural Gas","NG","Unknown",732.7067886377964,"g/kWh","De-regionalized (Steubing et al 2022)"]
["Ecoinvent","Natural Gas","NG","Unknown",388.15813091209475,"g/kWh","De-regionalized (Steubing et al 2022)"]
["Ecoinvent","Natural Gas","NG","Unknown",742.1927969505949,"g/kWh","De-regionalized (Steubing et al 2022)"]
["Ecoinvent","Natural Gas","NG","Unknown",634.0665730025548,"g/kWh","De-regionalized (Steubing et al 2022)"]
["Ecoinvent","Natural Gas","NG","Unknown",594.1161543550485,"g/kWh","De-regionalized (Steubing et al 2022)"]
["Ecoinvent","Natural Gas","NG","Unknown",649.7811567963644,"g/kWh","De-regionalized (Steubing et al 2022)"]
["Ecoinvent","Natural Gas","NG","Unknown",619.4193043456295,"g/kWh","De-regionalized (Steubing et al 2022)"]
["Ecoinvent","Natural Gas","NG","Unknown",702.3807819394435,"g/kWh","De-regionalized (Steubing et al 2022)"]
["Ecoinvent","Natural Gas","NG","Unknown",784.4488948379628,"g/kWh","De-regionalized (Steubing et al 2022)"]
["Ecoinvent","Natural Gas","NG","Unknown",698.3074152878519,"g/kWh","De-regionalized (Steubing et al 2022)"]
["Ecoinvent","Natural Gas","NG","Unknown",673.6704891102123,"g/kWh","De-regionalized (Steubing et al 2022)"]
["Ecoinvent","Natural Gas","NG","Unknown",498.5747186806974,"g/kWh","De-regionalized (Steubing et al 2022)"]
["Ecoinvent","Natural Gas","NG","Unknown",424.3904084455349,"g/kWh","De-regionalized (Steubing et al 2022)"]
["Ecoinvent","Natural Gas","NG","Unknown",428.39755698822603,"g/kWh","De-regionalized (Steubing et al 2022)"]
["Ecoinvent","Natural Gas","NG","Unknown",674.5843003270338,"g/kWh","De-regionalized (Steubing et al 2022)"]
["Ecoinvent","Natural Gas","NG","Unknown",444.0772204961322,"g/kWh","De-regionalized (Steubing et al 2022)"]
["Ecoinvent","Natural Gas","NG","Unknown",703.4605734108786,"g/kWh","De-regionalized (Steubing et al 2022)"]
["Ecoinvent","Natural Gas","NG","Unknown",356.0482523432451,"g/kWh","De-regionalized (Steubing et al 2022)"]
["Ecoinvent","Natural Gas","NG","Unknown",520.99469393792,"g/kWh","De-regionalized (Steubing et al 2022)"]
["Ecoinvent","Natural Gas","NG","Unknown",384.36154066676846,"g/kWh","De-regionalized (Steubing et al 2022)"]
["Ecoinvent","Natural Gas","NG","Unknown",462.7429115516963,"g/kWh","De-regionalized (Steubing et al 2022)"]
["Ecoinvent","Natural Gas","NG","Unknown",510.4939502498682,"g/kWh","De-regionalized (Steubing et al 2022)"]
["Ecoinvent","Natural Gas","NG","Unknown",1033.821770192743,"g/kWh","De-regionalized (Steubing et al 2022)"]
["Ecoinvent","Natural Gas","NG","Unknown",572.6043801044499,"g/kWh","De-regionalized (Steubing et al 2022)"]
["Ecoinvent","Natural Gas","NG","Unknown",732.3719477899825,"g/kWh","De-regionalized (Steubing et al 2022)"]
["Ecoinvent","Natural Gas","NG","Unknown",426.64025269075614,"g/kWh","De-regionalized (Steubing et al 2022)"]
["Ecoinvent","Natural Gas","NG","Unknown",622.5215510914375,"g/kWh","De-regionalized (Steubing et al 2022)"]
["Ecoinvent","Natural Gas","NG","Unknown",436.3245190478693,"g/kWh","De-regionalized (Steubing et al 2022)"]
["Ecoinvent","Natural Gas","NG","Unknown",591.8357068057485,"g/kWh","De-regionalized (Steubing et al 2022)"]
["Ecoinvent","Natural Gas","NG","Unknown",442.6193008585323,"g/kWh","De-regionalized (Steubing et al 2022)"]
["Ecoinvent","Natural Gas","NG","Unknown",678.3210249358517,"g/kWh","De-regionalized (Steubing et al 2022)"]
["Ecoinvent","Natural Gas","NG","Unknown",438.0768426341856,"g/kWh","De-regionalized (Steubing et al 2022)"]
["Ecoinvent","Natural Gas","NG","Unknown",591.8357068057485,"g/kWh","De-regionalized (Steubing et al 2022)"]
["Ecoinvent","Natural Gas","NG","Unknown",437.70130330835985,"g/kWh","De-regionalized (Steubing et al 2022)"]
["Ecoinvent","Natural Gas","NG","Unknown",660.6256592252099,"g/kWh","De-regionalized (Steubing et al 2022)"]
["Ecoinvent","Natural Gas","NG","Unknown",436.3245190478693,"g/kWh","De-regionalized (Steubing et al 2022)"]
["Ecoinvent","Natural Gas","NG","Unknown",591.8357068057484,"g/kWh","De-regionalized (Steubing et al 2022)"]
["Ecoinvent","Natural Gas","NG","Unknown",432.8913925337453,"g/kWh","De-regionalized (Steubing et al 2022)"]
["Ecoinvent","Natural Gas","NG","Unknown",644.3441795572061,"g/kWh","De-regionalized (Steubing et al 2022)"]
["Ecoinvent","Natural Gas","NG","Unknown",436.32451904786916,"g/kWh","De-regionalized (Steubing et al 2022)"]
["Ecoinvent","Natural Gas","NG","Unknown",591.8357068057483,"g/kWh","De-regionalized (Steubing et al 2022)"]
["Ecoinvent","Natural Gas","NG","Unknown",461.6380962742142,"g/kWh","De-regionalized (Steubing et al 2022)"]
["Ecoinvent","Natural Gas","NG","Unknown",747.2651313121385,"g/kWh","De-regionalized (Steubing et al 2022)"]
["Ecoinvent","Natural Gas","NG","Unknown",513.3229623748234,"g/kWh","De-regionalized (Steubing et al 2022)"]
["Ecoinvent","Natural Gas","NG","Unknown",591.8357068057485,"g/kWh","De-regionalized (Steubing et al 2022)"]
["Ecoinvent","Natural Gas","NG","Unknown",460.73820763740594,"g/kWh","De-regionalized (Steubing et al 2022)"]
["Ecoinvent","Natural Gas","NG","Unknown",747.1760493067557,"g/kWh","De-regionalized (Steubing et al 2022)"]
["Ecoinvent","Natural Gas","NG","Unknown",507.3541016450405,"g/kWh","De-regionalized (Steubing et al 2022)"]
["Ecoinvent","Natural Gas","NG","Unknown",591.8357068057486,"g/kWh","De-regionalized (Steubing et al 2022)"]
["Ecoinvent","Natural Gas","NG","Unknown",432.8913925337453,"g/kWh","De-regionalized (Steubing et al 2022)"]
["Ecoinvent","Natural Gas","NG","Unknown",645.6540220443197,"g/kWh","De-regionalized (Steubing et al 2022)"]
["Ecoinvent","Natural Gas","NG","Unknown",436.3245190478693,"g/kWh","De-regionalized (Steubing et al 2022)"]
["Ecoinvent","Natural Gas","NG","Unknown",591.8357068057487,"g/kWh","De-regionalized (Steubing et al 2022)"]
["Ecoinvent","Natural Gas","NG","Unknown",417.5948714691284,"g/kWh","De-regionalized (Steubing et al 2022)"]
["Ecoinvent","Natural Gas","NG","Unknown",598.8311988520171,"g/kWh","De-regionalized (Steubing et al 2022)"]
["Ecoinvent","Natural Gas","NG","Unknown",436.3245190478693,"g/kWh","De-regionalized (Steubing et al 2022)"]
["Ecoinvent","Natural Gas","NG","Unknown",591.8357068057487,"g/kWh","De-regionalized (Steubing et al 2022)"]
["Ecoinvent","Natural Gas","NG","Unknown",511.6970643095683,"g/kWh","De-regionalized (Steubing et al 2022)"]
["Ecoinvent","Natural Gas","NG","Unknown",801.2210305038053,"g/kWh","De-regionalized (Steubing et al 2022)"]
["Ecoinvent","Natural Gas","NG","Unknown",427.56892954195405,"g/kWh","De-regionalized (Steubing et al 2022)"]
["Ecoinvent","Natural Gas","NG","Unknown",684.994491032317,"g/kWh","De-regionalized (Steubing et al 2022)"]
["Ecoinvent","Natural Gas","NG","Unknown",448.38365061362873,"g/kWh","De-regionalized (Steubing et al 2022)"]
["Ecoinvent","Natural Gas","NG","Unknown",722.9258245952153,"g/kWh","De-regionalized (Steubing et al 2022)"]
["Ecoinvent","Natural Gas","NG","Unknown",421.8571244448953,"g/kWh","De-regionalized (Steubing et al 2022)"]
["Ecoinvent","Natural Gas","NG","Unknown",767.9523607224323,"g/kWh","De-regionalized (Steubing et al 2022)"]
["Ecoinvent","Natural Gas","NG","Unknown",570.4953217933039,"g/kWh","De-regionalized (Steubing et al 2022)"]
["Ecoinvent","Natural Gas","NG","Unknown",681.9646894973903,"g/kWh","De-regionalized (Steubing et al 2022)"]
["Ecoinvent","Natural Gas","NG","Unknown",500.474610246553,"g/kWh","De-regionalized (Steubing et al 2022)"]
["Ecoinvent","Natural Gas","NG","Unknown",672.2570131161235,"g/kWh","De-regionalized (Steubing et al 2022)"]
["Ecoinvent","Natural Gas","NG","Unknown",809.3570579418027,"g/kWh","De-regionalized (Steubing et al 2022)"]
["Ecoinvent","Natural Gas","NG","Unknown",432.1800597269381,"g/kWh","De-regionalized (Steubing et al 2022)"]
["Ecoinvent","Natural Gas","NG","Unknown",641.7066851811948,"g/kWh","De-regionalized (Steubing et al 2022)"]
["Ecoinvent","Natural Gas","NG","Unknown",963.7970553844854,"g/kWh","De-regionalized (Steubing et al 2022)"]
["Ecoinvent","Natural Gas","NG","Unknown",683.9841395186717,"g/kWh","De-regionalized (Steubing et al 2022)"]
["Ecoinvent","Natural Gas","NG","Unknown",643.299227541371,"g/kWh","De-regionalized (Steubing et al 2022)"]
["Ecoinvent","Natural Gas","NG","Unknown",421.0535820359863,"g/kWh","De-regionalized (Steubing et al 2022)"]
["Ecoinvent","Natural Gas","NG","Unknown",691.3963390187816,"g/kWh","De-regionalized (Steubing et al 2022)"]
["Ecoinvent","Natural Gas","NG","Unknown",362.5244820562207,"g/kWh","De-regionalized (Steubing et al 2022)"]
["Ecoinvent","Natural Gas","NG","Unknown",478.9157962222415,"g/kWh","De-regionalized (Steubing et al 2022)"]
["Ecoinvent","Natural Gas","NG","Unknown",418.661250748591,"g/kWh","De-regionalized (Steubing et al 2022)"]
["Ecoinvent","Natural Gas","NG","Unknown",784.2340030443512,"g/kWh","De-regionalized (Steubing et al 2022)"]
["Ecoinvent","Natural Gas","NG","Unknown",495.25202618971196,"g/kWh","De-regionalized (Steubing et al 2022)"]
["Ecoinvent","Natural Gas","NG","Unknown",676.5353422878183,"g/kWh","De-regionalized (Steubing et al 2022)"]
["Ecoinvent","Natural Gas","NG","Unknown",631.5261796852578,"g/kWh","De-regionalized (Steubing et al 2022)"]
["Ecoinvent","Natural Gas","NG","Unknown",587.866645681553,"g/kWh","De-regionalized (Steubing et al 2022)"]
["Ecoinvent","Natural Gas","NG","Unknown",699.6768448084988,"g/kWh","De-regionalized (Steubing et al 2022)"]
["Ecoinvent","Natural Gas","NG","Unknown",784.2207077392557,"g/kWh","De-regionalized (Steubing et al 2022)"]
["Ecoinvent","Hydro","HY","Unknown",1374.985901680698,"g/kWh","De-regionalized (Steubing et al 2022)"]
["Ecoinvent","Hydro","HY","Unknown",4.404442450969873,"g/kWh","De-regionalized (Steubing et al 2022)"]
["Ecoinvent","Hydro","HY","Unknown",450.89203827691085,"g/kWh","De-regionalized (Steubing et al 2022)"]
["Ecoinvent","Hydro","HY","Unknown",6.961851452552374,"g/kWh","De-regionalized (Steubing et al 2022)"]
["Ecoinvent","Hydro","HY","Unknown",4.412025420213806,"g/kWh","De-regionalized (Steubing et al 2022)"]
["Ecoinvent","Hydro","HY","Unknown",337.0836995113074,"g/kWh","De-regionalized (Steubing et al 2022)"]
["Ecoinvent","Hydro","HY","Unknown",4.412025420213806,"g/kWh","De-regionalized (Steubing et al 2022)"]
["Ecoinvent","Hydro","HY","Unknown",45.29487872832857,"g/kWh","De-regionalized (Steubing et al 2022)"]
["Ecoinvent","Hydro","HY","Unknown",900.2800852535931,"g/kWh","De-regionalized (Steubing et al 2022)"]
["Ecoinvent","Hydro","HY","Unknown",4.412025420213806,"g/kWh","De-regionalized (Steubing et al 2022)"]
["Ecoinvent","Hydro","HY","Unknown",1306.274055189896,"g/kWh","De-regionalized (Steubing et al 2022)"]
["Ecoinvent","Hydro","HY","Unknown",6.95426848330844,"g/kWh","De-regionalized (Steubing et al 2022)"]
["Ecoinvent","Hydro","HY","Unknown",4.404442450969873,"g/kWh","De-regionalized (Steubing et al 2022)"]
["Ecoinvent","Hydro","HY","Unknown",151.67720259399618,"g/kWh","De-regionalized (Steubing et al 2022)"]
["Ecoinvent","Hydro","HY","Unknown",6.95426848330844,"g/kWh","De-regionalized (Steubing et al 2022)"]
["Ecoinvent","Hydro","HY","Unknown",4.404442450969873,"g/kWh","De-regionalized (Steubing et al 2022)"]
["Ecoinvent","Hydro","HY","Unknown",51.71350330634038,"g/kWh","De-regionalized (Steubing et al 2022)"]
["Ecoinvent","Hydro","HY","Unknown",12.34887877262829,"g/kWh","De-regionalized (Steubing et al 2022)"]
["Ecoinvent","Hydro","HY","Unknown",4.404442450969873,"g/kWh","De-regionalized (Steubing et al 2022)"]
["Ecoinvent","Hydro","HY","Unknown",609.8522978879065,"g/kWh","De-regionalized (Steubing et al 2022)"]
["Ecoinvent","Hydro","HY","Unknown",12.34887877262829,"g/kWh","De-regionalized (Steubing et al 2022)"]
["Ecoinvent","Hydro","HY","Unknown",4.404442450969873,"g/kWh","De-regionalized (Steubing et al 2022)"]
["Ecoinvent","Hydro","HY","Unknown",12.34887877262829,"g/kWh","De-regionalized (Steubing et al 2022)"]
["Ecoinvent","Hydro","HY","Unknown",4.404442450969873,"g/kWh","De-regionalized (Steubing et al 2022)"]
["Ecoinvent","Hydro","HY","Unknown",1387.5688690722661,"g/kWh","De-regionalized (Steubing et al 2022)"]
["Ecoinvent","Hydro","HY","Unknown",12.34887877262828,"g/kWh","De-regionalized (Steubing et al 2022)"]
["Ecoinvent","Hydro","HY","Unknown",4.404442450969873,"g/kWh","De-regionalized (Steubing et al 2022)"]
["Ecoinvent","Hydro","HY","Unknown",494.2997892456097,"g/kWh","De-regionalized (Steubing et al 2022)"]
["Ecoinvent","Hydro","HY","Unknown",6.95426848330844,"g/kWh","De-regionalized (Steubing et al 2022)"]
["Ecoinvent","Hydro","HY","Unknown",12.34887877262829,"g/kWh","De-regionalized (Steubing et al 2022)"]
["Ecoinvent","Hydro","HY","Unknown",4.404442450969873,"g/kWh","De-regionalized (Steubing et al 2022)"]
["Ecoinvent","Hydro","HY","Unknown",136.6549466417385,"g/kWh","De-regionalized (Steubing et al 2022)"]
["Ecoinvent","Hydro","HY","Unknown",12.34887877262829,"g/kWh","De-regionalized (Steubing et al 2022)"]
["Ecoinvent","Hydro","HY","Unknown",4.404442450969873,"g/kWh","De-regionalized (Steubing et al 2022)"]
["Ecoinvent","Hydro","HY","Unknown",12.34887877262829,"g/kWh","De-regionalized (Steubing et al 2022)"]
["Ecoinvent","Hydro","HY","Unknown",4.404442450969873,"g/kWh","De-regionalized (Steubing et al 2022)"]
["Ecoinvent","Hydro","HY","Unknown",3.9568871698167336,"g/kWh","De-regionalized (Steubing et al 2022)"]
["Ecoinvent","Hydro","HY","Unknown",5.520141500725642,"g/kWh","De-regionalized (Steubing et al 2022)"]
["Ecoinvent","Hydro","HY","Unknown",1034.1073589373439,"g/kWh","De-regionalized (Steubing et al 2022)"]
["Ecoinvent","Hydro","HY","Unknown",12.34887877262829,"g/kWh","De-regionalized (Steubing et al 2022)"]
["Ecoinvent","Hydro","HY","Unknown",4.404442450969873,"g/kWh","De-regionalized (Steubing et al 2022)"]
["Ecoinvent","Hydro","HY","Unknown",100.1760681922438,"g/kWh","De-regionalized (Steubing et al 2022)"]
["Ecoinvent","Hydro","HY","Unknown",6.95426848330844,"g/kWh","De-regionalized (Steubing et al 2022)"]
["Ecoinvent","Hydro","HY","Unknown",4.404442450969873,"g/kWh","De-regionalized (Steubing et al 2022)"]
["Ecoinvent","Hydro","HY","Unknown",1625.431077385038,"g/kWh","De-regionalized (Steubing et al 2022)"]
["Ecoinvent","Hydro","HY","Unknown",4.404442450969873,"g/kWh","De-regionalized (Steubing et al 2022)"]
["Ecoinvent","Hydro","HY","Unknown",4.404442450969873,"g/kWh","De-regionalized (Steubing et al 2022)"]
["Ecoinvent","Hydro","HY","Unknown",4.404442450969873,"g/kWh","De-regionalized (Steubing et al 2022)"]
["Ecoinvent","Hydro","HY","Unknown",1625.431077385038,"g/kWh","De-regionalized (Steubing et al 2022)"]
["Ecoinvent","Hydro","HY","Unknown",4.404442450969873,"g/kWh","De-regionalized (Steubing et al 2022)"]
["Ecoinvent","Hydro","HY","Unknown",1534.007359959692,"g/kWh","De-regionalized (Steubing et al 2022)"]
["Ecoinvent","Hydro","HY","Unknown",4.404442450969873,"g/kWh","De-regionalized (Steubing et al 2022)"]
["Ecoinvent","Hydro","HY","Unknown",4.404442450969873,"g/kWh","De-regionalized (Steubing et al 2022)"]
["Ecoinvent","Hydro","HY","Unknown",4.404442450969873,"g/kWh","De-regionalized (Steubing et al 2022)"]
["Ecoinvent","Hydro","HY","Unknown",4.404442450969873,"g/kWh","De-regionalized (Steubing et al 2022)"]
["Ecoinvent","Hydro","HY","Unknown",4.404442450969873,"g/kWh","De-regionalized (Steubing et al 2022)"]
["Ecoinvent","Hydro","HY","Unknown",1625.431077385038,"g/kWh","De-regionalized (Steubing et al 2022)"]
["Ecoinvent","Hydro","HY","Unknown",4.404442450969873,"g/kWh","De-regionalized (Steubing et al 2022)"]
["Ecoinvent","Hydro","HY","Unknown",1625.431077385038,"g/kWh","De-regionalized (Steubing et al 2022)"]
["Ecoinvent","Hydro","HY","Unknown",4.404442450969873,"g/kWh","De-regionalized (Steubing et al 2022)"]
["Ecoinvent","Hydro","HY","Unknown",4.404442450969873,"g/kWh","De-regionalized (Steubing et al 2022)"]
["Ecoinvent","Hydro","HY","Unknown",1625.431077385038,"g/kWh","De-regionalized (Steubing et al 2022)"]
["Ecoinvent","Hydro","HY","Unknown",4.404442450969873,"g/kWh","De-regionalized (Steubing et al 2022)"]
["Ecoinvent","Hydro","HY","Unknown",1625.431077385038,"g/kWh","De-regionalized (Steubing et al 2022)"]
["Ecoinvent","Hydro","HY","Unknown",4.404442450969873,"g/kWh","De-regionalized (Steubing et al 2022)"]
["Ecoinvent","Hydro","HY","Unknown",4.404442450969873,"g/kWh","De-regionalized (Steubing et al 2022)"]
["Ecoinvent","Hydro","HY","Unknown",1625.431077385038,"g/kWh","De-regionalized (Steubing et al 2022)"]
["Ecoinvent","Hydro","HY","Unknown",4.404442450969873,"g/kWh","De-regionalized (Steubing et al 2022)"]
["Ecoinvent","Hydro","HY","Unknown",4.404442450969873,"g/kWh","De-regionalized (Steubing et al 2022)"]
["Ecoinvent","Hydro","HY","Unknown",1625.431077385038,"g/kWh","De-regionalized (Steubing et al 2022)"]
["Ecoinvent","Hydro","HY","Unknown",4.404442450969873,"g/kWh","De-regionalized (Steubing et al 2022)"]
["Ecoinvent","Hydro","HY","Unknown",4.404442450969873,"g/kWh","De-regionalized (Steubing et al 2022)"]
["Ecoinvent","Hydro","HY","Unknown",4.404442450969873,"g/kWh","De-regionalized (Steubing et al 2022)"]
["Ecoinvent","Hydro","HY","Unknown",4.404442450969873,"g/kWh","De-regionalized (Steubing et al 2022)"]
["Ecoinvent","Hydro","HY","Unknown",4.404442450969873,"g/kWh","De-regionalized (Steubing et al 2022)"]
["Ecoinvent","Hydro","HY","Unknown",4.404442450969873,"g/kWh","De-regionalized (Steubing et al 2022)"]
["Ecoinvent","Hydro","HY","Unknown",1625.431077385038,"g/kWh","De-regionalized (Steubing et al 2022)"]
["Ecoinvent","Hydro","HY","Unknown",4.404442450969873,"g/kWh","De-regionalized (Steubing et al 2022)"]
["Ecoinvent","Hydro","HY","Unknown",1625.431077385038,"g/kWh","De-regionalized (Steubing et al 2022)"]
["Ecoinvent","Hydro","HY","Unknown",4.404442450969873,"g/kWh","De-regionalized (Steubing et al 2022)"]
["Ecoinvent","Hydro","HY","Unknown",4.404442450969873,"g/kWh","De-regionalized (Steubing et al 2022)"]
["Ecoinvent","Hydro","HY","Unknown",4.404442450969873,"g/kWh","De-regionalized (Steubing et al 2022)"]
["Ecoinvent","Hydro","HY","Unknown",4.404442450969873,"g/kWh","De-regionalized (Steubing et al 2022)"]
["Ecoinvent","Hydro","HY","Unknown",4.404442450969873,"g/kWh","De-regionalized (Steubing et al 2022)"]
["Ecoinvent","Hydro","HY","Unknown",1625.431077385038,"g/kWh","De-regionalized (Steubing et al 2022)"]
["Ecoinvent","Hydro","HY","Unknown",4.404442450969873,"g/kWh","De-regionalized (Steubing et al 2022)"]
["Ecoinvent","Hydro","HY","Unknown",1100.904551128745,"g/kWh","De-regionalized (Steubing et al 2022)"]
["Ecoinvent","Hydro","HY","Unknown",12.35646174187222,"g/kWh","De-regionalized (Steubing et al 2022)"]
["Ecoinvent","Hydro","HY","Unknown",4.412025420213806,"g/kWh","De-regionalized (Steubing et al 2022)"]
["Ecoinvent","Hydro","HY","Unknown",4.412025420213806,"g/kWh","De-regionalized (Steubing et al 2022)"]
["Ecoinvent","Hydro","HY","Unknown",4.412025420213806,"g/kWh","De-regionalized (Steubing et al 2022)"]
["Ecoinvent","Hydro","HY","Unknown",12.35646174187222,"g/kWh","De-regionalized (Steubing et al 2022)"]
["Ecoinvent","Hydro","HY","Unknown",4.412025420213806,"g/kWh","De-regionalized (Steubing et al 2022)"]
["Ecoinvent","Hydro","HY","Unknown",76.07895992396304,"g/kWh","De-regionalized (Steubing et al 2022)"]
["Ecoinvent","Hydro","HY","Unknown",6.961851452552374,"g/kWh","De-regionalized (Steubing et al 2022)"]
["Ecoinvent","Hydro","HY","Unknown",4.412025420213806,"g/kWh","De-regionalized (Steubing et al 2022)"]
["Ecoinvent","Hydro","HY","Unknown",924.3787401363462,"g/kWh","De-regionalized (Steubing et al 2022)"]
["Ecoinvent","Hydro","HY","Unknown",12.35646174187222,"g/kWh","De-regionalized (Steubing et al 2022)"]
["Ecoinvent","Hydro","HY","Unknown",4.412025420213806,"g/kWh","De-regionalized (Steubing et al 2022)"]
["Ecoinvent","Hydro","HY","Unknown",1376.804198355754,"g/kWh","De-regionalized (Steubing et al 2022)"]
["Ecoinvent","Hydro","HY","Unknown",4.412025420213806,"g/kWh","De-regionalized (Steubing et al 2022)"]
["Ecoinvent","Hydro","HY","Unknown",4.412025420213806,"g/kWh","De-regionalized (Steubing et al 2022)"]
["Ecoinvent","Hydro","HY","Unknown",580.014260612342,"g/kWh","De-regionalized (Steubing et al 2022)"]
["Ecoinvent","Hydro","HY","Unknown",6.961851452552374,"g/kWh","De-regionalized (Steubing et al 2022)"]
["Ecoinvent","Hydro","HY","Unknown",4.412025420213806,"g/kWh","De-regionalized (Steubing et al 2022)"]
["Ecoinvent","Hydro","HY","Unknown",2029.050242507715,"g/kWh","De-regionalized (Steubing et al 2022)"]
["Ecoinvent","Hydro","HY","Unknown",6.95426848330844,"g/kWh","De-regionalized (Steubing et al 2022)"]
["Ecoinvent","Hydro","HY","Unknown",4.404442450969873,"g/kWh","De-regionalized (Steubing et al 2022)"]
["Ecoinvent","Hydro","HY","Unknown",4.404442450969873,"g/kWh","De-regionalized (Steubing et al 2022)"]
["Ecoinvent","Hydro","HY","Unknown",6.95426848330844,"g/kWh","De-regionalized (Steubing et al 2022)"]
["Ecoinvent","Hydro","HY","Unknown",4.404442450969873,"g/kWh","De-regionalized (Steubing et al 2022)"]
["Ecoinvent","Hydro","HY","Unknown",2490.07651356674,"g/kWh","De-regionalized (Steubing et al 2022)"]
["Ecoinvent","Hydro","HY","Unknown",6.95426848330844,"g/kWh","De-regionalized (Steubing et al 2022)"]
["Ecoinvent","Hydro","HY","Unknown",6.954268483308442,"g/kWh","De-regionalized (Steubing et al 2022)"]
["Ecoinvent","Hydro","HY","Unknown",2295.405889119035,"g/kWh","De-regionalized (Steubing et al 2022)"]
["Ecoinvent","Hydro","HY","Unknown",6.95426848330844,"g/kWh","De-regionalized (Steubing et al 2022)"]
["Ecoinvent","Hydro","HY","Unknown",4.404442450969873,"g/kWh","De-regionalized (Steubing et al 2022)"]
["Ecoinvent","Hydro","HY","Unknown",6.95426848330844,"g/kWh","De-regionalized (Steubing et al 2022)"]
["Ecoinvent","Hydro","HY","Unknown",4.404442450969873,"g/kWh","De-regionalized (Steubing et al 2022)"]
["Ecoinvent","Hydro","HY","Unknown",6.95426848330844,"g/kWh","De-regionalized (Steubing et al 2022)"]
["Ecoinvent","Hydro","HY","Unknown",4.404442450969873,"g/kWh","De-regionalized (Steubing et al 2022)"]
["Ecoinvent","Hydro","HY","Unknown",6.95426848330844,"g/kWh","De-regionalized (Steubing et al 2022)"]
["Ecoinvent","Hydro","HY","Unknown",4.404442450969873,"g/kWh","De-regionalized (Steubing et al 2022)"]
["Ecoinvent","Hydro","HY","Unknown",6.95426848330844,"g/kWh","De-regionalized (Steubing et al 2022)"]
["Ecoinvent","Hydro","HY","Unknown",4.404442450969873,"g/kWh","De-regionalized (Steubing et al 2022)"]
["Ecoinvent","Hydro","HY","Unknown",2295.405889119035,"g/kWh","De-regionalized (Steubing et al 2022)"]
["Ecoinvent","Hydro","HY","Unknown",6.95426848330844,"g/kWh","De-regionalized (Steubing et al 2022)"]
["Ecoinvent","Hydro","HY","Unknown",4.404442450969873,"g/kWh","De-regionalized (Steubing et al 2022)"]
["Ecoinvent","Hydro","HY","Unknown",6.95426848330844,"g/kWh","De-regionalized (Steubing et al 2022)"]
["Ecoinvent","Hydro","HY","Unknown",4.404442450969873,"g/kWh","De-regionalized (Steubing et al 2022)"]
["Ecoinvent","Hydro","HY","Unknown",6.95426848330844,"g/kWh","De-regionalized (Steubing et al 2022)"]
["Ecoinvent","Hydro","HY","Unknown",6.95426848330844,"g/kWh","De-regionalized (Steubing et al 2022)"]
["Ecoinvent","Hydro","HY","Unknown",4.404442450969873,"g/kWh","De-regionalized (Steubing et al 2022)"]
["Ecoinvent","Hydro","HY","Unknown",6.95426848330844,"g/kWh","De-regionalized (Steubing et al 2022)"]
["Ecoinvent","Hydro","HY","Unknown",6.95426848330844,"g/kWh","De-regionalized (Steubing et al 2022)"]
["Ecoinvent","Hydro","HY","Unknown",6.95426848330844,"g/kWh","De-regionalized (Steubing et al 2022)"]
["Ecoinvent","Hydro","HY","Unknown",4.404442450969873,"g/kWh","De-regionalized (Steubing et al 2022)"]
["Ecoinvent","Hydro","HY","Unknown",6.95426848330844,"g/kWh","De-regionalized (Steubing et al 2022)"]
["Ecoinvent","Hydro","HY","Unknown",4.404442450969873,"g/kWh","De-regionalized (Steubing et al 2022)"]
["Ecoinvent","Hydro","HY","Unknown",4.404442450969873,"g/kWh","De-regionalized (Steubing et al 2022)"]
["Ecoinvent","Hydro","HY","Unknown",2029.050242507715,"g/kWh","De-regionalized (Steubing et al 2022)"]
["Ecoinvent","Hydro","HY","Unknown",6.95426848330844,"g/kWh","De-regionalized (Steubing et al 2022)"]
["Ecoinvent","Hydro","HY","Unknown",4.404442450969873,"g/kWh","De-regionalized (Steubing et al 2022)"]
["Ecoinvent","Hydro","HY","Unknown",6.95426848330844,"g/kWh","De-regionalized (Steubing et al 2022)"]
["Ecoinvent","Hydro","HY","Unknown",4.404442450969873,"g/kWh","De-regionalized (Steubing et al 2022)"]
["Ecoinvent","Hydro","HY","Unknown",6.95426848330844,"g/kWh","De-regionalized (Steubing et al 2022)"]
["Ecoinvent","Hydro","HY","Unknown",4.404442450969873,"g/kWh","De-regionalized (Steubing et al 2022)"]
["Ecoinvent","Hydro","HY","Unknown",2490.07651356674,"g/kWh","De-regionalized (Steubing et al 2022)"]
["Ecoinvent","Hydro","HY","Unknown",4.404442450969873,"g/kWh","De-regionalized (Steubing et al 2022)"]
["Ecoinvent","Hydro","HY","Unknown",45.29487872832855,"g/kWh","De-regionalized (Steubing et al 2022)"]
["Ecoinvent","Hydro","HY","Unknown",811.5967087455125,"g/kWh","De-regionalized (Steubing et al 2022)"]
["Ecoinvent","Hydro","HY","Unknown",4.412025420213806,"g/kWh","De-regionalized (Steubing et al 2022)"]
["Ecoinvent","Hydro","HY","Unknown",614.1460845849509,"g/kWh","De-regionalized (Steubing et al 2022)"]
["Ecoinvent","Hydro","HY","Unknown",6.961851452552374,"g/kWh","De-regionalized (Steubing et al 2022)"]
["Ecoinvent","Hydro","HY","Unknown",4.412025420213806,"g/kWh","De-regionalized (Steubing et al 2022)"]
["Ecoinvent","Hydro","HY","Unknown",1091.551106466148,"g/kWh","De-regionalized (Steubing et al 2022)"]
["Ecoinvent","Hydro","HY","Unknown",6.95426848330844,"g/kWh","De-regionalized (Steubing et al 2022)"]
["Ecoinvent","Hydro","HY","Unknown",4.404442450969873,"g/kWh","De-regionalized (Steubing et al 2022)"]
["Ecoinvent","Hydro","HY","Unknown",6.961851452552374,"g/kWh","De-regionalized (Steubing et al 2022)"]
["Ecoinvent","Hydro","HY","Unknown",4.412025420213806,"g/kWh","De-regionalized (Steubing et al 2022)"]
["Ecoinvent","Hydro","HY","Unknown",993.8348327007134,"g/kWh","De-regionalized (Steubing et al 2022)"]
["Ecoinvent","Hydro","HY","Unknown",4.412025420213806,"g/kWh","De-regionalized (Steubing et al 2022)"]
["Ecoinvent","Hydro","HY","Unknown",744.0832967157371,"g/kWh","De-regionalized (Steubing et al 2022)"]
["Ecoinvent","Hydro","HY","Unknown",4.412025420213806,"g/kWh","De-regionalized (Steubing et al 2022)"]
["Ecoinvent","Hydro","HY","Unknown",4.404442450969873,"g/kWh","De-regionalized (Steubing et al 2022)"]
["Ecoinvent","Hydro","HY","Unknown",4.412025420213806,"g/kWh","De-regionalized (Steubing et al 2022)"]
["Ecoinvent","Hydro","HY","Unknown",41.459910496227515,"g/kWh","De-regionalized (Steubing et al 2022)"]
["Ecoinvent","Hydro","HY","Unknown",6.961851452552374,"g/kWh","De-regionalized (Steubing et al 2022)"]
["Ecoinvent","Hydro","HY","Unknown",1416.1999579742198,"g/kWh","De-regionalized (Steubing et al 2022)"]
["Ecoinvent","Hydro","HY","Unknown",4.412025420213806,"g/kWh","De-regionalized (Steubing et al 2022)"]
["Ecoinvent","Hydro","HY","Unknown",541.0636979042717,"g/kWh","De-regionalized (Steubing et al 2022)"]
["Ecoinvent","Hydro","HY","Unknown",12.356461741872211,"g/kWh","De-regionalized (Steubing et al 2022)"]
["Ecoinvent","Hydro","HY","Unknown",4.412025420213806,"g/kWh","De-regionalized (Steubing et al 2022)"]
["Ecoinvent","Hydro","HY","Unknown",628.7587921867611,"g/kWh","De-regionalized (Steubing et al 2022)"]
["Ecoinvent","Hydro","HY","Unknown",4.412025420213806,"g/kWh","De-regionalized (Steubing et al 2022)"]
["Ecoinvent","Hydro","HY","Unknown",1054.157747638883,"g/kWh","De-regionalized (Steubing et al 2022)"]
["Ecoinvent","Hydro","HY","Unknown",12.34887877262829,"g/kWh","De-regionalized (Steubing et al 2022)"]
["Ecoinvent","Hydro","HY","Unknown",4.404442450969873,"g/kWh","De-regionalized (Steubing et al 2022)"]
["Ecoinvent","Hydro","HY","Unknown",641.8093911512958,"g/kWh","De-regionalized (Steubing et al 2022)"]
["Ecoinvent","Hydro","HY","Unknown",12.356461741872211,"g/kWh","De-regionalized (Steubing et al 2022)"]
["Ecoinvent","Hydro","HY","Unknown",4.412025420213806,"g/kWh","De-regionalized (Steubing et al 2022)"]
["Ecoinvent","Hydro","HY","Unknown",616.0564863956187,"g/kWh","De-regionalized (Steubing et al 2022)"]
["Ecoinvent","Hydro","HY","Unknown",4.412025420213806,"g/kWh","De-regionalized (Steubing et al 2022)"]
["Ecoinvent","Hydro","HY","Unknown",1593.897070182821,"g/kWh","De-regionalized (Steubing et al 2022)"]
["Ecoinvent","Hydro","HY","Unknown",12.34887877262829,"g/kWh","De-regionalized (Steubing et al 2022)"]
["Ecoinvent","Hydro","HY","Unknown",4.404442450969873,"g/kWh","De-regionalized (Steubing et al 2022)"]
["Ecoinvent","Hydro","HY","Unknown",918.8919586548961,"g/kWh","De-regionalized (Steubing et al 2022)"]
["Ecoinvent","Hydro","HY","Unknown",12.34887877262829,"g/kWh","De-regionalized (Steubing et al 2022)"]
["Ecoinvent","Hydro","HY","Unknown",4.404442450969873,"g/kWh","De-regionalized (Steubing et al 2022)"]
["Ecoinvent","Hydro","HY","Unknown",501.7343365773972,"g/kWh","De-regionalized (Steubing et al 2022)"]
["Ecoinvent","Hydro","HY","Unknown",12.356461741872211,"g/kWh","De-regionalized (Steubing et al 2022)"]
["Ecoinvent","Hydro","HY","Unknown",4.412025420213806,"g/kWh","De-regionalized (Steubing et al 2022)"]
["Ecoinvent","Hydro","HY","Unknown",58.101486919077956,"g/kWh","De-regionalized (Steubing et al 2022)"]
["Ecoinvent","Hydro","HY","Unknown",12.356461741872211,"g/kWh","De-regionalized (Steubing et al 2022)"]
["Ecoinvent","Hydro","HY","Unknown",4.412025420213806,"g/kWh","De-regionalized (Steubing et al 2022)"]
["Ecoinvent","Hydro","HY","Unknown",176.9774844323079,"g/kWh","De-regionalized (Steubing et al 2022)"]
["Ecoinvent","Hydro","HY","Unknown",6.964327331313594,"g/kWh","De-regionalized (Steubing et al 2022)"]
["Ecoinvent","Hydro","HY","Unknown",4.414501298975016,"g/kWh","De-regionalized (Steubing et al 2022)"]
["Ecoinvent","Hydro","HY","Unknown",12.34887877262829,"g/kWh","De-regionalized (Steubing et al 2022)"]
["Ecoinvent","Hydro","HY","Unknown",4.404442450969873,"g/kWh","De-regionalized (Steubing et al 2022)"]
["Ecoinvent","Hydro","HY","Unknown",1106.9099985065661,"g/kWh","De-regionalized (Steubing et al 2022)"]
["Ecoinvent","Hydro","HY","Unknown",4.412025420213806,"g/kWh","De-regionalized (Steubing et al 2022)"]
["Ecoinvent","Hydro","HY","Unknown",950.5765778960932,"g/kWh","De-regionalized (Steubing et al 2022)"]
["Ecoinvent","Hydro","HY","Unknown",6.95426848330844,"g/kWh","De-regionalized (Steubing et al 2022)"]
["Ecoinvent","Hydro","HY","Unknown",4.404442450969873,"g/kWh","De-regionalized (Steubing et al 2022)"]
["Ecoinvent","Hydro","HY","Unknown",926.9695958899317,"g/kWh","De-regionalized (Steubing et al 2022)"]
["Ecoinvent","Hydro","HY","Unknown",12.34887877262828,"g/kWh","De-regionalized (Steubing et al 2022)"]
["Ecoinvent","Hydro","HY","Unknown",4.404442450969873,"g/kWh","De-regionalized (Steubing et al 2022)"]
["Ecoinvent","Hydro","HY","Unknown",1298.4302364852508,"g/kWh","De-regionalized (Steubing et al 2022)"]
["Ecoinvent","Hydro","HY","Unknown",12.34887877262828,"g/kWh","De-regionalized (Steubing et al 2022)"]
["Ecoinvent","Hydro","HY","Unknown",4.404442450969873,"g/kWh","De-regionalized (Steubing et al 2022)"]
["Ecoinvent","Hydro","HY","Unknown",1073.113962446872,"g/kWh","De-regionalized (Steubing et al 2022)"]
["Ecoinvent","Hydro","HY","Unknown",6.95426848330844,"g/kWh","De-regionalized (Steubing et al 2022)"]
["Ecoinvent","Hydro","HY","Unknown",4.404442450969873,"g/kWh","De-regionalized (Steubing et al 2022)"]
["Ecoinvent","Hydro","HY","Unknown",426.9670980668538,"g/kWh","De-regionalized (Steubing et al 2022)"]
["Ecoinvent","Hydro","HY","Unknown",6.95426848330844,"g/kWh","De-regionalized (Steubing et al 2022)"]
["Ecoinvent","Hydro","HY","Unknown",4.404442450969873,"g/kWh","De-regionalized (Steubing et al 2022)"]
["Ecoinvent","Hydro","HY","Unknown",1056.4022600859898,"g/kWh","De-regionalized (Steubing et al 2022)"]
["Ecoinvent","Hydro","HY","Unknown",6.954268483308442,"g/kWh","De-regionalized (Steubing et al 2022)"]
["Ecoinvent","Hydro","HY","Unknown",4.404442450969873,"g/kWh","De-regionalized (Steubing et al 2022)"]
["Ecoinvent","Hydro","HY","Unknown",1051.1693236406509,"g/kWh","De-regionalized (Steubing et al 2022)"]
["Ecoinvent","Hydro","HY","Unknown",6.954268483308442,"g/kWh","De-regionalized (Steubing et al 2022)"]
["Ecoinvent","Hydro","HY","Unknown",4.404442450969873,"g/kWh","De-regionalized (Steubing et al 2022)"]
["Ecoinvent","Hydro","HY","Unknown",1132.905410118286,"g/kWh","De-regionalized (Steubing et al 2022)"]
["Ecoinvent","Hydro","HY","Unknown",12.34887877262829,"g/kWh","De-regionalized (Steubing et al 2022)"]
["Ecoinvent","Hydro","HY","Unknown",4.404442450969873,"g/kWh","De-regionalized (Steubing et al 2022)"]
["Ecoinvent","Hydro","HY","Unknown",1026.55632375508,"g/kWh","De-regionalized (Steubing et al 2022)"]
["Ecoinvent","Hydro","HY","Unknown",12.34887877262829,"g/kWh","De-regionalized (Steubing et al 2022)"]
["Ecoinvent","Hydro","HY","Unknown",4.404442450969873,"g/kWh","De-regionalized (Steubing et al 2022)"]
["Ecoinvent","Hydro","HY","Unknown",714.2874665683107,"g/kWh","De-regionalized (Steubing et al 2022)"]
["Ecoinvent","Hydro","HY","Unknown",6.95426848330844,"g/kWh","De-regionalized (Steubing et al 2022)"]
["Ecoinvent","Hydro","HY","Unknown",4.404442450969873,"g/kWh","De-regionalized (Steubing et al 2022)"]
["Ecoinvent","Hydro","HY","Unknown",45.29487872832857,"g/kWh","De-regionalized (Steubing et al 2022)"]
["Ecoinvent","Hydro","HY","Unknown",4.404442450969873,"g/kWh","De-regionalized (Steubing et al 2022)"]
["Ecoinvent","Hydro","HY","Unknown",45.29487872832857,"g/kWh","De-regionalized (Steubing et al 2022)"]
["Ecoinvent","Hydro","HY","Unknown",6.954268483308442,"g/kWh","De-regionalized (Steubing et al 2022)"]
["Ecoinvent","Hydro","HY","Unknown",4.404442450969873,"g/kWh","De-regionalized (Steubing et al 2022)"]
["Ecoinvent","Hydro","HY","Unknown",6.95426848330844,"g/kWh","De-regionalized (Steubing et al 2022)"]
["Ecoinvent","Hydro","HY","Unknown",1139.576491483567,"g/kWh","De-regionalized (Steubing et al 2022)"]
["Ecoinvent","Hydro","HY","Unknown",6.9618514525523745,"g/kWh","De-regionalized (Steubing et al 2022)"]
["Ecoinvent","Hydro","HY","Unknown",4.412025420213806,"g/kWh","De-regionalized (Steubing et al 2022)"]
["Ecoinvent","Hydro","HY","Unknown",12.356461741872211,"g/kWh","De-regionalized (Steubing et al 2022)"]
["Ecoinvent","Hydro","HY","Unknown",6.9618514525523745,"g/kWh","De-regionalized (Steubing et al 2022)"]
["Ecoinvent","Hydro","HY","Unknown",4.412025420213806,"g/kWh","De-regionalized (Steubing et al 2022)"]
["Ecoinvent","Hydro","HY","Unknown",1216.338106423209,"g/kWh","De-regionalized (Steubing et al 2022)"]
["Ecoinvent","Hydro","HY","Unknown",6.961851452552374,"g/kWh","De-regionalized (Steubing et al 2022)"]
["Ecoinvent","Hydro","HY","Unknown",4.412025420213806,"g/kWh","De-regionalized (Steubing et al 2022)"]
["Ecoinvent","Hydro","HY","Unknown",972.1126481401353,"g/kWh","De-regionalized (Steubing et al 2022)"]
["Ecoinvent","Hydro","HY","Unknown",4.412025420213806,"g/kWh","De-regionalized (Steubing et al 2022)"]
["Ecoinvent","Hydro","HY","Unknown",12.34887877262828,"g/kWh","De-regionalized (Steubing et al 2022)"]
["Ecoinvent","Hydro","HY","Unknown",4.404442450969873,"g/kWh","De-regionalized (Steubing et al 2022)"]
["Ecoinvent","Wind","WI","Unknown",12.519256804410539,"g/kWh","De-regionalized (Steubing et al 2022)"]
["Ecoinvent","Wind","WI","Unknown",20.910918440833488,"g/kWh","De-regionalized (Steubing et al 2022)"]
["Ecoinvent","Wind","WI","Unknown",13.13079383299845,"g/kWh","De-regionalized (Steubing et al 2022)"]
["Ecoinvent","Wind","WI","Unknown",16.61474363353403,"g/kWh","De-regionalized (Steubing et al 2022)"]
["Ecoinvent","Wind","WI","Unknown",27.72168986367209,"g/kWh","De-regionalized (Steubing et al 2022)"]
["Ecoinvent","Wind","WI","Unknown",17.42415492529726,"g/kWh","De-regionalized (Steubing et al 2022)"]
["Ecoinvent","Wind","WI","Unknown",14.84837091460256,"g/kWh","De-regionalized (Steubing et al 2022)"]
["Ecoinvent","Wind","WI","Unknown",24.77450099200063,"g/kWh","De-regionalized (Steubing et al 2022)"]
["Ecoinvent","Wind","WI","Unknown",15.710740471553061,"g/kWh","De-regionalized (Steubing et al 2022)"]
["Ecoinvent","Wind","WI","Unknown",15.57173225260387,"g/kWh","De-regionalized (Steubing et al 2022)"]
["Ecoinvent","Wind","WI","Unknown",14.702912294101349,"g/kWh","De-regionalized (Steubing et al 2022)"]
["Ecoinvent","Wind","WI","Unknown",24.558281515307918,"g/kWh","De-regionalized (Steubing et al 2022)"]
["Ecoinvent","Wind","WI","Unknown",15.421116802128509,"g/kWh","De-regionalized (Steubing et al 2022)"]
["Ecoinvent","Wind","WI","Unknown",16.63601279944513,"g/kWh","De-regionalized (Steubing et al 2022)"]
["Ecoinvent","Wind","WI","Unknown",27.75718013572257,"g/kWh","De-regionalized (Steubing et al 2022)"]
["Ecoinvent","Wind","WI","Unknown",17.44646111859199,"g/kWh","De-regionalized (Steubing et al 2022)"]
["Ecoinvent","Wind","WI","Unknown",16.23826225060635,"g/kWh","De-regionalized (Steubing et al 2022)"]
["Ecoinvent","Wind","WI","Unknown",27.12277518409662,"g/kWh","De-regionalized (Steubing et al 2022)"]
["Ecoinvent","Wind","WI","Unknown",17.031464029003512,"g/kWh","De-regionalized (Steubing et al 2022)"]
["Ecoinvent","Wind","WI","Unknown",16.23826225060635,"g/kWh","De-regionalized (Steubing et al 2022)"]
["Ecoinvent","Wind","WI","Unknown",17.031464029003512,"g/kWh","De-regionalized (Steubing et al 2022)"]
["Ecoinvent","Wind","WI","Unknown",16.23826225060635,"g/kWh","De-regionalized (Steubing et al 2022)"]
["Ecoinvent","Wind","WI","Unknown",27.12277518409662,"g/kWh","De-regionalized (Steubing et al 2022)"]
["Ecoinvent","Wind","WI","Unknown",17.031464029003512,"g/kWh","De-regionalized (Steubing et al 2022)"]
["Ecoinvent","Wind","WI","Unknown",16.23826225060635,"g/kWh","De-regionalized (Steubing et al 2022)"]
["Ecoinvent","Wind","WI","Unknown",27.12277518409662,"g/kWh","De-regionalized (Steubing et al 2022)"]
["Ecoinvent","Wind","WI","Unknown",17.031464029003512,"g/kWh","De-regionalized (Steubing et al 2022)"]
["Ecoinvent","Wind","WI","Unknown",16.23826225060635,"g/kWh","De-regionalized (Steubing et al 2022)"]
["Ecoinvent","Wind","WI","Unknown",17.031464029003512,"g/kWh","De-regionalized (Steubing et al 2022)"]
["Ecoinvent","Wind","WI","Unknown",16.23826225060635,"g/kWh","De-regionalized (Steubing et al 2022)"]
["Ecoinvent","Wind","WI","Unknown",27.12277518409662,"g/kWh","De-regionalized (Steubing et al 2022)"]
["Ecoinvent","Wind","WI","Unknown",17.031464029003512,"g/kWh","De-regionalized (Steubing et al 2022)"]
["Ecoinvent","Wind","WI","Unknown",16.23826225060635,"g/kWh","De-regionalized (Steubing et al 2022)"]
["Ecoinvent","Wind","WI","Unknown",17.031464029003512,"g/kWh","De-regionalized (Steubing et al 2022)"]
["Ecoinvent","Wind","WI","Unknown",16.23826225060635,"g/kWh","De-regionalized (Steubing et al 2022)"]
["Ecoinvent","Wind","WI","Unknown",27.12277518409662,"g/kWh","De-regionalized (Steubing et al 2022)"]
["Ecoinvent","Wind","WI","Unknown",17.031464029003512,"g/kWh","De-regionalized (Steubing et al 2022)"]
["Ecoinvent","Wind","WI","Unknown",16.23826225060635,"g/kWh","De-regionalized (Steubing et al 2022)"]
["Ecoinvent","Wind","WI","Unknown",27.12277518409662,"g/kWh","De-regionalized (Steubing et al 2022)"]
["Ecoinvent","Wind","WI","Unknown",17.031464029003512,"g/kWh","De-regionalized (Steubing et al 2022)"]
["Ecoinvent","Wind","WI","Unknown",11.02285248320452,"g/kWh","De-regionalized (Steubing et al 2022)"]
["Ecoinvent","Wind","WI","Unknown",34.19763451253982,"g/kWh","De-regionalized (Steubing et al 2022)"]
["Ecoinvent","Wind","WI","Unknown",13.43355193350506,"g/kWh","De-regionalized (Steubing et al 2022)"]
["Ecoinvent","Wind","WI","Unknown",36.01252106467735,"g/kWh","De-regionalized (Steubing et al 2022)"]
["Ecoinvent","Wind","WI","Unknown",16.23826225060635,"g/kWh","De-regionalized (Steubing et al 2022)"]
["Ecoinvent","Wind","WI","Unknown",27.12277518409662,"g/kWh","De-regionalized (Steubing et al 2022)"]
["Ecoinvent","Wind","WI","Unknown",17.031464029003512,"g/kWh","De-regionalized (Steubing et al 2022)"]
["Ecoinvent","Wind","WI","Unknown",16.23826225060635,"g/kWh","De-regionalized (Steubing et al 2022)"]
["Ecoinvent","Wind","WI","Unknown",27.12277518409662,"g/kWh","De-regionalized (Steubing et al 2022)"]
["Ecoinvent","Wind","WI","Unknown",17.031464029003512,"g/kWh","De-regionalized (Steubing et al 2022)"]
["Ecoinvent","Wind","WI","Unknown",21.698935997201698,"g/kWh","De-regionalized (Steubing et al 2022)"]
["Ecoinvent","Wind","WI","Unknown",36.9525280791792,"g/kWh","De-regionalized (Steubing et al 2022)"]
["Ecoinvent","Wind","WI","Unknown",22.758879714140182,"g/kWh","De-regionalized (Steubing et al 2022)"]
["Ecoinvent","Wind","WI","Unknown",21.698935997201698,"g/kWh","De-regionalized (Steubing et al 2022)"]
["Ecoinvent","Wind","WI","Unknown",36.9525280791792,"g/kWh","De-regionalized (Steubing et al 2022)"]
["Ecoinvent","Wind","WI","Unknown",22.758879714140182,"g/kWh","De-regionalized (Steubing et al 2022)"]
["Ecoinvent","Wind","WI","Unknown",21.698935997201698,"g/kWh","De-regionalized (Steubing et al 2022)"]
["Ecoinvent","Wind","WI","Unknown",36.9525280791792,"g/kWh","De-regionalized (Steubing et al 2022)"]
["Ecoinvent","Wind","WI","Unknown",22.758879714140182,"g/kWh","De-regionalized (Steubing et al 2022)"]
["Ecoinvent","Wind","WI","Unknown",21.698935997201698,"g/kWh","De-regionalized (Steubing et al 2022)"]
["Ecoinvent","Wind","WI","Unknown",36.9525280791792,"g/kWh","De-regionalized (Steubing et al 2022)"]
["Ecoinvent","Wind","WI","Unknown",22.758879714140182,"g/kWh","De-regionalized (Steubing et al 2022)"]
["Ecoinvent","Wind","WI","Unknown",21.698935997201698,"g/kWh","De-regionalized (Steubing et al 2022)"]
["Ecoinvent","Wind","WI","Unknown",36.9525280791792,"g/kWh","De-regionalized (Steubing et al 2022)"]
["Ecoinvent","Wind","WI","Unknown",15.65306577098826,"g/kWh","De-regionalized (Steubing et al 2022)"]
["Ecoinvent","Wind","WI","Unknown",22.758879714140182,"g/kWh","De-regionalized (Steubing et al 2022)"]
["Ecoinvent","Wind","WI","Unknown",21.698935997201698,"g/kWh","De-regionalized (Steubing et al 2022)"]
["Ecoinvent","Wind","WI","Unknown",36.9525280791792,"g/kWh","De-regionalized (Steubing et al 2022)"]
["Ecoinvent","Wind","WI","Unknown",22.758879714140182,"g/kWh","De-regionalized (Steubing et al 2022)"]
["Ecoinvent","Wind","WI","Unknown",21.698935997201698,"g/kWh","De-regionalized (Steubing et al 2022)"]
["Ecoinvent","Wind","WI","Unknown",36.9525280791792,"g/kWh","De-regionalized (Steubing et al 2022)"]
["Ecoinvent","Wind","WI","Unknown",22.758879714140182,"g/kWh","De-regionalized (Steubing et al 2022)"]
["Ecoinvent","Wind","WI","Unknown",21.698935997201698,"g/kWh","De-regionalized (Steubing et al 2022)"]
["Ecoinvent","Wind","WI","Unknown",36.9525280791792,"g/kWh","De-regionalized (Steubing et al 2022)"]
["Ecoinvent","Wind","WI","Unknown",22.758879714140182,"g/kWh","De-regionalized (Steubing et al 2022)"]
["Ecoinvent","Wind","WI","Unknown",21.698935997201698,"g/kWh","De-regionalized (Steubing et al 2022)"]
["Ecoinvent","Wind","WI","Unknown",36.9525280791792,"g/kWh","De-regionalized (Steubing et al 2022)"]
["Ecoinvent","Wind","WI","Unknown",22.758879714140182,"g/kWh","De-regionalized (Steubing et al 2022)"]
["Ecoinvent","Wind","WI","Unknown",21.698935997201698,"g/kWh","De-regionalized (Steubing et al 2022)"]
["Ecoinvent","Wind","WI","Unknown",36.9525280791792,"g/kWh","De-regionalized (Steubing et al 2022)"]
["Ecoinvent","Wind","WI","Unknown",22.758879714140182,"g/kWh","De-regionalized (Steubing et al 2022)"]
["Ecoinvent","Wind","WI","Unknown",21.698935997201698,"g/kWh","De-regionalized (Steubing et al 2022)"]
["Ecoinvent","Wind","WI","Unknown",36.9525280791792,"g/kWh","De-regionalized (Steubing et al 2022)"]
["Ecoinvent","Wind","WI","Unknown",22.758879714140182,"g/kWh","De-regionalized (Steubing et al 2022)"]
["Ecoinvent","Wind","WI","Unknown",21.698935997201698,"g/kWh","De-regionalized (Steubing et al 2022)"]
["Ecoinvent","Wind","WI","Unknown",36.9525280791792,"g/kWh","De-regionalized (Steubing et al 2022)"]
["Ecoinvent","Wind","WI","Unknown",22.758879714140182,"g/kWh","De-regionalized (Steubing et al 2022)"]
["Ecoinvent","Wind","WI","Unknown",21.698935997201698,"g/kWh","De-regionalized (Steubing et al 2022)"]
["Ecoinvent","Wind","WI","Unknown",36.9525280791792,"g/kWh","De-regionalized (Steubing et al 2022)"]
["Ecoinvent","Wind","WI","Unknown",22.758879714140182,"g/kWh","De-regionalized (Steubing et al 2022)"]
["Ecoinvent","Wind","WI","Unknown",21.698935997201698,"g/kWh","De-regionalized (Steubing et al 2022)"]
["Ecoinvent","Wind","WI","Unknown",36.9525280791792,"g/kWh","De-regionalized (Steubing et al 2022)"]
["Ecoinvent","Wind","WI","Unknown",22.758879714140182,"g/kWh","De-regionalized (Steubing et al 2022)"]
["Ecoinvent","Wind","WI","Unknown",21.698935997201698,"g/kWh","De-regionalized (Steubing et al 2022)"]
["Ecoinvent","Wind","WI","Unknown",36.9525280791792,"g/kWh","De-regionalized (Steubing et al 2022)"]
["Ecoinvent","Wind","WI","Unknown",22.758879714140182,"g/kWh","De-regionalized (Steubing et al 2022)"]
["Ecoinvent","Wind","WI","Unknown",21.698935997201698,"g/kWh","De-regionalized (Steubing et al 2022)"]
["Ecoinvent","Wind","WI","Unknown",36.9525280791792,"g/kWh","De-regionalized (Steubing et al 2022)"]
["Ecoinvent","Wind","WI","Unknown",15.65306577098826,"g/kWh","De-regionalized (Steubing et al 2022)"]
["Ecoinvent","Wind","WI","Unknown",22.758879714140182,"g/kWh","De-regionalized (Steubing et al 2022)"]
["Ecoinvent","Wind","WI","Unknown",21.698935997201698,"g/kWh","De-regionalized (Steubing et al 2022)"]
["Ecoinvent","Wind","WI","Unknown",36.9525280791792,"g/kWh","De-regionalized (Steubing et al 2022)"]
["Ecoinvent","Wind","WI","Unknown",22.758879714140182,"g/kWh","De-regionalized (Steubing et al 2022)"]
["Ecoinvent","Wind","WI","Unknown",21.698935997201698,"g/kWh","De-regionalized (Steubing et al 2022)"]
["Ecoinvent","Wind","WI","Unknown",36.9525280791792,"g/kWh","De-regionalized (Steubing et al 2022)"]
["Ecoinvent","Wind","WI","Unknown",15.65306577098826,"g/kWh","De-regionalized (Steubing et al 2022)"]
["Ecoinvent","Wind","WI","Unknown",22.758879714140182,"g/kWh","De-regionalized (Steubing et al 2022)"]
["Ecoinvent","Wind","WI","Unknown",21.698935997201698,"g/kWh","De-regionalized (Steubing et al 2022)"]
["Ecoinvent","Wind","WI","Unknown",36.9525280791792,"g/kWh","De-regionalized (Steubing et al 2022)"]
["Ecoinvent","Wind","WI","Unknown",22.758879714140182,"g/kWh","De-regionalized (Steubing et al 2022)"]
["Ecoinvent","Wind","WI","Unknown",21.698935997201698,"g/kWh","De-regionalized (Steubing et al 2022)"]
["Ecoinvent","Wind","WI","Unknown",36.9525280791792,"g/kWh","De-regionalized (Steubing et al 2022)"]
["Ecoinvent","Wind","WI","Unknown",22.758879714140182,"g/kWh","De-regionalized (Steubing et al 2022)"]
["Ecoinvent","Wind","WI","Unknown",21.698935997201698,"g/kWh","De-regionalized (Steubing et al 2022)"]
["Ecoinvent","Wind","WI","Unknown",36.9525280791792,"g/kWh","De-regionalized (Steubing et al 2022)"]
["Ecoinvent","Wind","WI","Unknown",22.758879714140182,"g/kWh","De-regionalized (Steubing et al 2022)"]
["Ecoinvent","Wind","WI","Unknown",21.698935997201698,"g/kWh","De-regionalized (Steubing et al 2022)"]
["Ecoinvent","Wind","WI","Unknown",36.9525280791792,"g/kWh","De-regionalized (Steubing et al 2022)"]
["Ecoinvent","Wind","WI","Unknown",22.758879714140182,"g/kWh","De-regionalized (Steubing et al 2022)"]
["Ecoinvent","Wind","WI","Unknown",21.698935997201698,"g/kWh","De-regionalized (Steubing et al 2022)"]
["Ecoinvent","Wind","WI","Unknown",36.9525280791792,"g/kWh","De-regionalized (Steubing et al 2022)"]
["Ecoinvent","Wind","WI","Unknown",22.758879714140182,"g/kWh","De-regionalized (Steubing et al 2022)"]
["Ecoinvent","Wind","WI","Unknown",21.698935997201698,"g/kWh","De-regionalized (Steubing et al 2022)"]
["Ecoinvent","Wind","WI","Unknown",36.9525280791792,"g/kWh","De-regionalized (Steubing et al 2022)"]
["Ecoinvent","Wind","WI","Unknown",15.65306577098826,"g/kWh","De-regionalized (Steubing et al 2022)"]
["Ecoinvent","Wind","WI","Unknown",22.758879714140182,"g/kWh","De-regionalized (Steubing et al 2022)"]
["Ecoinvent","Wind","WI","Unknown",21.698935997201698,"g/kWh","De-regionalized (Steubing et al 2022)"]
["Ecoinvent","Wind","WI","Unknown",36.9525280791792,"g/kWh","De-regionalized (Steubing et al 2022)"]
["Ecoinvent","Wind","WI","Unknown",15.65306577098826,"g/kWh","De-regionalized (Steubing et al 2022)"]
["Ecoinvent","Wind","WI","Unknown",22.758879714140182,"g/kWh","De-regionalized (Steubing et al 2022)"]
["Ecoinvent","Wind","WI","Unknown",21.698935997201698,"g/kWh","De-regionalized (Steubing et al 2022)"]
["Ecoinvent","Wind","WI","Unknown",36.9525280791792,"g/kWh","De-regionalized (Steubing et al 2022)"]
["Ecoinvent","Wind","WI","Unknown",22.758879714140182,"g/kWh","De-regionalized (Steubing et al 2022)"]
["Ecoinvent","Wind","WI","Unknown",21.698935997201698,"g/kWh","De-regionalized (Steubing et al 2022)"]
["Ecoinvent","Wind","WI","Unknown",36.9525280791792,"g/kWh","De-regionalized (Steubing et al 2022)"]
["Ecoinvent","Wind","WI","Unknown",22.758879714140182,"g/kWh","De-regionalized (Steubing et al 2022)"]
["Ecoinvent","Wind","WI","Unknown",21.698935997201698,"g/kWh","De-regionalized (Steubing et al 2022)"]
["Ecoinvent","Wind","WI","Unknown",36.9525280791792,"g/kWh","De-regionalized (Steubing et al 2022)"]
["Ecoinvent","Wind","WI","Unknown",22.758879714140182,"g/kWh","De-regionalized (Steubing et al 2022)"]
["Ecoinvent","Wind","WI","Unknown",21.698935997201698,"g/kWh","De-regionalized (Steubing et al 2022)"]
["Ecoinvent","Wind","WI","Unknown",36.9525280791792,"g/kWh","De-regionalized (Steubing et al 2022)"]
["Ecoinvent","Wind","WI","Unknown",22.758879714140182,"g/kWh","De-regionalized (Steubing et al 2022)"]
["Ecoinvent","Wind","WI","Unknown",21.698935997201698,"g/kWh","De-regionalized (Steubing et al 2022)"]
["Ecoinvent","Wind","WI","Unknown",36.9525280791792,"g/kWh","De-regionalized (Steubing et al 2022)"]
["Ecoinvent","Wind","WI","Unknown",22.758879714140182,"g/kWh","De-regionalized (Steubing et al 2022)"]
["Ecoinvent","Wind","WI","Unknown",23.53347248977131,"g/kWh","De-regionalized (Steubing et al 2022)"]
["Ecoinvent","Wind","WI","Unknown",34.200085372588454,"g/kWh","De-regionalized (Steubing et al 2022)"]
["Ecoinvent","Wind","WI","Unknown",24.683030882790312,"g/kWh","De-regionalized (Steubing et al 2022)"]
["Ecoinvent","Wind","WI","Unknown",18.56046447171597,"g/kWh","De-regionalized (Steubing et al 2022)"]
["Ecoinvent","Wind","WI","Unknown",34.25524547054205,"g/kWh","De-regionalized (Steubing et al 2022)"]
["Ecoinvent","Wind","WI","Unknown",19.46466422985859,"g/kWh","De-regionalized (Steubing et al 2022)"]
["Ecoinvent","Wind","WI","Unknown",12.034843621286079,"g/kWh","De-regionalized (Steubing et al 2022)"]
["Ecoinvent","Wind","WI","Unknown",20.080130642641272,"g/kWh","De-regionalized (Steubing et al 2022)"]
["Ecoinvent","Wind","WI","Unknown",15.710740471553061,"g/kWh","De-regionalized (Steubing et al 2022)"]
["Ecoinvent","Wind","WI","Unknown",12.62113935903029,"g/kWh","De-regionalized (Steubing et al 2022)"]
["Ecoinvent","Wind","WI","Unknown",18.406506665661798,"g/kWh","De-regionalized (Steubing et al 2022)"]
["Ecoinvent","Wind","WI","Unknown",30.71124669405584,"g/kWh","De-regionalized (Steubing et al 2022)"]
["Ecoinvent","Wind","WI","Unknown",15.710740471553061,"g/kWh","De-regionalized (Steubing et al 2022)"]
["Ecoinvent","Wind","WI","Unknown",19.30320614038869,"g/kWh","De-regionalized (Steubing et al 2022)"]
["Ecoinvent","Wind","WI","Unknown",17.31308119775753,"g/kWh","De-regionalized (Steubing et al 2022)"]
["Ecoinvent","Wind","WI","Unknown",28.88686571720217,"g/kWh","De-regionalized (Steubing et al 2022)"]
["Ecoinvent","Wind","WI","Unknown",15.710740471553061,"g/kWh","De-regionalized (Steubing et al 2022)"]
["Ecoinvent","Wind","WI","Unknown",18.1565141284064,"g/kWh","De-regionalized (Steubing et al 2022)"]
["Ecoinvent","Wind","WI","Unknown",14.88202521127463,"g/kWh","De-regionalized (Steubing et al 2022)"]
["Ecoinvent","Wind","WI","Unknown",24.830651782809127,"g/kWh","De-regionalized (Steubing et al 2022)"]
["Ecoinvent","Wind","WI","Unknown",15.710740471553061,"g/kWh","De-regionalized (Steubing et al 2022)"]
["Ecoinvent","Wind","WI","Unknown",15.60702519966214,"g/kWh","De-regionalized (Steubing et al 2022)"]
["Ecoinvent","Wind","WI","Unknown",18.349036321850953,"g/kWh","De-regionalized (Steubing et al 2022)"]
["Ecoinvent","Wind","WI","Unknown",30.61535706935531,"g/kWh","De-regionalized (Steubing et al 2022)"]
["Ecoinvent","Wind","WI","Unknown",15.710740471553061,"g/kWh","De-regionalized (Steubing et al 2022)"]
["Ecoinvent","Wind","WI","Unknown",19.242936477977512,"g/kWh","De-regionalized (Steubing et al 2022)"]
["Ecoinvent","Wind","WI","Unknown",13.49080649205514,"g/kWh","De-regionalized (Steubing et al 2022)"]
["Ecoinvent","Wind","WI","Unknown",22.50940301211164,"g/kWh","De-regionalized (Steubing et al 2022)"]
["Ecoinvent","Wind","WI","Unknown",14.14803119208659,"g/kWh","De-regionalized (Steubing et al 2022)"]
["Ecoinvent","Wind","WI","Unknown",12.68860820071926,"g/kWh","De-regionalized (Steubing et al 2022)"]
["Ecoinvent","Wind","WI","Unknown",21.17093610932385,"g/kWh","De-regionalized (Steubing et al 2022)"]
["Ecoinvent","Wind","WI","Unknown",13.306752400808259,"g/kWh","De-regionalized (Steubing et al 2022)"]
["Ecoinvent","Wind","WI","Unknown",16.2474575664829,"g/kWh","De-regionalized (Steubing et al 2022)"]
["Ecoinvent","Wind","WI","Unknown",34.25524547054205,"g/kWh","De-regionalized (Steubing et al 2022)"]
["Ecoinvent","Wind","WI","Unknown",17.03897770810161,"g/kWh","De-regionalized (Steubing et al 2022)"]
["Ecoinvent","Wind","WI","Unknown",19.65161563207813,"g/kWh","De-regionalized (Steubing et al 2022)"]
["Ecoinvent","Wind","WI","Unknown",19.65161563207813,"g/kWh","De-regionalized (Steubing et al 2022)"]
["Ecoinvent","Wind","WI","Unknown",19.65161563207813,"g/kWh","De-regionalized (Steubing et al 2022)"]
["Ecoinvent","Wind","WI","Unknown",19.65161563207813,"g/kWh","De-regionalized (Steubing et al 2022)"]
["Ecoinvent","Wind","WI","Unknown",19.65161563207813,"g/kWh","De-regionalized (Steubing et al 2022)"]
["Ecoinvent","Wind","WI","Unknown",19.65161563207813,"g/kWh","De-regionalized (Steubing et al 2022)"]
["Ecoinvent","Wind","WI","Unknown",19.65161563207813,"g/kWh","De-regionalized (Steubing et al 2022)"]
["Ecoinvent","Wind","WI","Unknown",34.197474190947815,"g/kWh","De-regionalized (Steubing et al 2022)"]
["Ecoinvent","Wind","WI","Unknown",19.65161563207813,"g/kWh","De-regionalized (Steubing et al 2022)"]
["Ecoinvent","Wind","WI","Unknown",12.871057187640229,"g/kWh","De-regionalized (Steubing et al 2022)"]
["Ecoinvent","Wind","WI","Unknown",21.47535218670006,"g/kWh","De-regionalized (Steubing et al 2022)"]
["Ecoinvent","Wind","WI","Unknown",15.710740471553061,"g/kWh","De-regionalized (Steubing et al 2022)"]
["Ecoinvent","Wind","WI","Unknown",13.49809009559781,"g/kWh","De-regionalized (Steubing et al 2022)"]
["Ecoinvent","Wind","WI","Unknown",18.0391052614469,"g/kWh","De-regionalized (Steubing et al 2022)"]
["Ecoinvent","Wind","WI","Unknown",30.098236568424213,"g/kWh","De-regionalized (Steubing et al 2022)"]
["Ecoinvent","Wind","WI","Unknown",18.91790623079984,"g/kWh","De-regionalized (Steubing et al 2022)"]
["Ecoinvent","Wind","WI","Unknown",16.00221674022128,"g/kWh","De-regionalized (Steubing et al 2022)"]
["Ecoinvent","Wind","WI","Unknown",26.72850871589996,"g/kWh","De-regionalized (Steubing et al 2022)"]
["Ecoinvent","Wind","WI","Unknown",15.65306577098826,"g/kWh","De-regionalized (Steubing et al 2022)"]
["Ecoinvent","Wind","WI","Unknown",16.78388823217007,"g/kWh","De-regionalized (Steubing et al 2022)"]
["Ecoinvent","Wind","WI","Unknown",17.713846126044807,"g/kWh","De-regionalized (Steubing et al 2022)"]
["Ecoinvent","Wind","WI","Unknown",34.25524547054205,"g/kWh","De-regionalized (Steubing et al 2022)"]
["Ecoinvent","Wind","WI","Unknown",18.576802480797053,"g/kWh","De-regionalized (Steubing et al 2022)"]
["Ecoinvent","Wind","WI","Unknown",12.34553088276987,"g/kWh","De-regionalized (Steubing et al 2022)"]
["Ecoinvent","Wind","WI","Unknown",20.598511787720298,"g/kWh","De-regionalized (Steubing et al 2022)"]
["Ecoinvent","Wind","WI","Unknown",12.9469615611922,"g/kWh","De-regionalized (Steubing et al 2022)"]
["Ecoinvent","Wind","WI","Unknown",17.81804609395924,"g/kWh","De-regionalized (Steubing et al 2022)"]
["Ecoinvent","Wind","WI","Unknown",34.25524547054205,"g/kWh","De-regionalized (Steubing et al 2022)"]
["Ecoinvent","Wind","WI","Unknown",18.686079140072557,"g/kWh","De-regionalized (Steubing et al 2022)"]
["Ecoinvent","Wind","WI","Unknown",10.955998063838841,"g/kWh","De-regionalized (Steubing et al 2022)"]
["Ecoinvent","Wind","WI","Unknown",18.299806986546738,"g/kWh","De-regionalized (Steubing et al 2022)"]
["Ecoinvent","Wind","WI","Unknown",11.49117345704825,"g/kWh","De-regionalized (Steubing et al 2022)"]
["Ecoinvent","Wind","WI","Unknown",14.25229140038866,"g/kWh","De-regionalized (Steubing et al 2022)"]
["Ecoinvent","Wind","WI","Unknown",23.77994000632621,"g/kWh","De-regionalized (Steubing et al 2022)"]
["Ecoinvent","Wind","WI","Unknown",15.710740471553061,"g/kWh","De-regionalized (Steubing et al 2022)"]
["Ecoinvent","Wind","WI","Unknown",14.94661231872688,"g/kWh","De-regionalized (Steubing et al 2022)"]
["Ecoinvent","Wind","WI","Unknown",13.41697359421933,"g/kWh","De-regionalized (Steubing et al 2022)"]
["Ecoinvent","Wind","WI","Unknown",22.38621242718317,"g/kWh","De-regionalized (Steubing et al 2022)"]
["Ecoinvent","Wind","WI","Unknown",15.710740471553061,"g/kWh","De-regionalized (Steubing et al 2022)"]
["Ecoinvent","Wind","WI","Unknown",14.07060141477711,"g/kWh","De-regionalized (Steubing et al 2022)"]
["Ecoinvent","Wind","WI","Unknown",15.62097421699672,"g/kWh","De-regionalized (Steubing et al 2022)"]
["Ecoinvent","Wind","WI","Unknown",26.06358892848146,"g/kWh","De-regionalized (Steubing et al 2022)"]
["Ecoinvent","Wind","WI","Unknown",15.710740471553061,"g/kWh","De-regionalized (Steubing et al 2022)"]
["Ecoinvent","Wind","WI","Unknown",16.38197363919544,"g/kWh","De-regionalized (Steubing et al 2022)"]
["Ecoinvent","Wind","WI","Unknown",13.098524518623389,"g/kWh","De-regionalized (Steubing et al 2022)"]
["Ecoinvent","Wind","WI","Unknown",34.25524547054205,"g/kWh","De-regionalized (Steubing et al 2022)"]
["Ecoinvent","Wind","WI","Unknown",15.710740471553061,"g/kWh","De-regionalized (Steubing et al 2022)"]
["Ecoinvent","Wind","WI","Unknown",13.736638401414039,"g/kWh","De-regionalized (Steubing et al 2022)"]
["Ecoinvent","Wind","WI","Unknown",21.42889934778414,"g/kWh","De-regionalized (Steubing et al 2022)"]
["Ecoinvent","Wind","WI","Unknown",35.75410679305637,"g/kWh","De-regionalized (Steubing et al 2022)"]
["Ecoinvent","Wind","WI","Unknown",22.4728409136473,"g/kWh","De-regionalized (Steubing et al 2022)"]
["Ecoinvent","Wind","WI","Unknown",99.51297073845461,"g/kWh","De-regionalized (Steubing et al 2022)"]
["Ecoinvent","Wind","WI","Unknown",34.200085372588454,"g/kWh","De-regionalized (Steubing et al 2022)"]
["Ecoinvent","Wind","WI","Unknown",104.3739584222361,"g/kWh","De-regionalized (Steubing et al 2022)"]
["Ecoinvent","Wind","WI","Unknown",14.84837091460256,"g/kWh","De-regionalized (Steubing et al 2022)"]
["Ecoinvent","Wind","WI","Unknown",34.25524547054205,"g/kWh","De-regionalized (Steubing et al 2022)"]
["Ecoinvent","Wind","WI","Unknown",15.57173225260387,"g/kWh","De-regionalized (Steubing et al 2022)"]
["Ecoinvent","Wind","WI","Unknown",28.783081138592788,"g/kWh","De-regionalized (Steubing et al 2022)"]
["Ecoinvent","Wind","WI","Unknown",48.0763926696075,"g/kWh","De-regionalized (Steubing et al 2022)"]
["Ecoinvent","Wind","WI","Unknown",30.189068378657,"g/kWh","De-regionalized (Steubing et al 2022)"]
["Ecoinvent","Wind","WI","Unknown",15.58685165836292,"g/kWh","De-regionalized (Steubing et al 2022)"]
["Ecoinvent","Wind","WI","Unknown",26.034724475620038,"g/kWh","De-regionalized (Steubing et al 2022)"]
["Ecoinvent","Wind","WI","Unknown",15.65306577098826,"g/kWh","De-regionalized (Steubing et al 2022)"]
["Ecoinvent","Wind","WI","Unknown",16.34823350980091,"g/kWh","De-regionalized (Steubing et al 2022)"]
["Ecoinvent","Wind","WI","Unknown",13.68384074742284,"g/kWh","De-regionalized (Steubing et al 2022)"]
["Ecoinvent","Wind","WI","Unknown",22.83147991729831,"g/kWh","De-regionalized (Steubing et al 2022)"]
["Ecoinvent","Wind","WI","Unknown",15.710740471553061,"g/kWh","De-regionalized (Steubing et al 2022)"]
["Ecoinvent","Wind","WI","Unknown",14.350469398468292,"g/kWh","De-regionalized (Steubing et al 2022)"]
["Ecoinvent","Wind","WI","Unknown",15.52188470752864,"g/kWh","De-regionalized (Steubing et al 2022)"]
["Ecoinvent","Wind","WI","Unknown",25.89825584462881,"g/kWh","De-regionalized (Steubing et al 2022)"]
["Ecoinvent","Wind","WI","Unknown",15.710740471553061,"g/kWh","De-regionalized (Steubing et al 2022)"]
["Ecoinvent","Wind","WI","Unknown",16.2780566202034,"g/kWh","De-regionalized (Steubing et al 2022)"]
["Ecoinvent","Wind","WI","Unknown",17.44766587017604,"g/kWh","De-regionalized (Steubing et al 2022)"]
["Ecoinvent","Wind","WI","Unknown",34.2732555284225,"g/kWh","De-regionalized (Steubing et al 2022)"]
["Ecoinvent","Wind","WI","Unknown",18.296910092230018,"g/kWh","De-regionalized (Steubing et al 2022)"]
["Ecoinvent","Wind","WI","Unknown",11.68505157709096,"g/kWh","De-regionalized (Steubing et al 2022)"]
["Ecoinvent","Wind","WI","Unknown",19.51754621755773,"g/kWh","De-regionalized (Steubing et al 2022)"]
["Ecoinvent","Wind","WI","Unknown",12.255839577909509,"g/kWh","De-regionalized (Steubing et al 2022)"]
["Ecoinvent","Wind","WI","Unknown",12.80581083023618,"g/kWh","De-regionalized (Steubing et al 2022)"]
["Ecoinvent","Wind","WI","Unknown",21.366487504419702,"g/kWh","De-regionalized (Steubing et al 2022)"]
["Ecoinvent","Wind","WI","Unknown",15.710740471553061,"g/kWh","De-regionalized (Steubing et al 2022)"]
["Ecoinvent","Wind","WI","Unknown",13.42966538209985,"g/kWh","De-regionalized (Steubing et al 2022)"]
["Ecoinvent","Wind","WI","Unknown",12.371495240067931,"g/kWh","De-regionalized (Steubing et al 2022)"]
["Ecoinvent","Wind","WI","Unknown",20.6641138466623,"g/kWh","De-regionalized (Steubing et al 2022)"]
["Ecoinvent","Wind","WI","Unknown",12.97581423648733,"g/kWh","De-regionalized (Steubing et al 2022)"]
["Ecoinvent","Wind","WI","Unknown",12.371495240067931,"g/kWh","De-regionalized (Steubing et al 2022)"]
["Ecoinvent","Wind","WI","Unknown",20.6641138466623,"g/kWh","De-regionalized (Steubing et al 2022)"]
["Ecoinvent","Wind","WI","Unknown",12.97581423648733,"g/kWh","De-regionalized (Steubing et al 2022)"]
["Ecoinvent","Wind","WI","Unknown",12.371495240067931,"g/kWh","De-regionalized (Steubing et al 2022)"]
["Ecoinvent","Wind","WI","Unknown",20.6641138466623,"g/kWh","De-regionalized (Steubing et al 2022)"]
["Ecoinvent","Wind","WI","Unknown",12.97581423648733,"g/kWh","De-regionalized (Steubing et al 2022)"]
["Ecoinvent","Wind","WI","Unknown",12.371495240067931,"g/kWh","De-regionalized (Steubing et al 2022)"]
["Ecoinvent","Wind","WI","Unknown",20.6641138466623,"g/kWh","De-regionalized (Steubing et al 2022)"]
["Ecoinvent","Wind","WI","Unknown",12.97581423648733,"g/kWh","De-regionalized (Steubing et al 2022)"]
["Ecoinvent","Wind","WI","Unknown",12.371495240067931,"g/kWh","De-regionalized (Steubing et al 2022)"]
["Ecoinvent","Wind","WI","Unknown",20.6641138466623,"g/kWh","De-regionalized (Steubing et al 2022)"]
["Ecoinvent","Wind","WI","Unknown",12.97581423648733,"g/kWh","De-regionalized (Steubing et al 2022)"]
["Ecoinvent","Wind","WI","Unknown",12.371495240067931,"g/kWh","De-regionalized (Steubing et al 2022)"]
["Ecoinvent","Wind","WI","Unknown",20.6641138466623,"g/kWh","De-regionalized (Steubing et al 2022)"]
["Ecoinvent","Wind","WI","Unknown",12.97581423648733,"g/kWh","De-regionalized (Steubing et al 2022)"]
["Ecoinvent","Wind","WI","Unknown",12.371495240067931,"g/kWh","De-regionalized (Steubing et al 2022)"]
["Ecoinvent","Wind","WI","Unknown",20.6641138466623,"g/kWh","De-regionalized (Steubing et al 2022)"]
["Ecoinvent","Wind","WI","Unknown",12.97581423648733,"g/kWh","De-regionalized (Steubing et al 2022)"]
["Ecoinvent","Wind","WI","Unknown",12.371495240067931,"g/kWh","De-regionalized (Steubing et al 2022)"]
["Ecoinvent","Wind","WI","Unknown",20.6641138466623,"g/kWh","De-regionalized (Steubing et al 2022)"]
["Ecoinvent","Wind","WI","Unknown",12.97581423648733,"g/kWh","De-regionalized (Steubing et al 2022)"]
["Ecoinvent","Wind","WI","Unknown",12.371495240067931,"g/kWh","De-regionalized (Steubing et al 2022)"]
["Ecoinvent","Wind","WI","Unknown",20.6641138466623,"g/kWh","De-regionalized (Steubing et al 2022)"]
["Ecoinvent","Wind","WI","Unknown",12.97581423648733,"g/kWh","De-regionalized (Steubing et al 2022)"]
["Ecoinvent","Wind","WI","Unknown",16.67735416161844,"g/kWh","De-regionalized (Steubing et al 2022)"]
["Ecoinvent","Wind","WI","Unknown",13.758488611024509,"g/kWh","De-regionalized (Steubing et al 2022)"]
["Ecoinvent","Wind","WI","Unknown",22.98080854229712,"g/kWh","De-regionalized (Steubing et al 2022)"]
["Ecoinvent","Wind","WI","Unknown",14.43055908215467,"g/kWh","De-regionalized (Steubing et al 2022)"]
["Ecoinvent","Wind","WI","Unknown",20.73186862245981,"g/kWh","De-regionalized (Steubing et al 2022)"]
["Ecoinvent","Wind","WI","Unknown",34.62845000905088,"g/kWh","De-regionalized (Steubing et al 2022)"]
["Ecoinvent","Wind","WI","Unknown",21.74457503287153,"g/kWh","De-regionalized (Steubing et al 2022)"]
["Ecoinvent","Wind","WI","Unknown",16.7220499330316,"g/kWh","De-regionalized (Steubing et al 2022)"]
["Ecoinvent","Wind","WI","Unknown",28.45938062064091,"g/kWh","De-regionalized (Steubing et al 2022)"]
["Ecoinvent","Wind","WI","Unknown",47.48445681834982,"g/kWh","De-regionalized (Steubing et al 2022)"]
["Ecoinvent","Wind","WI","Unknown",29.84581906151371,"g/kWh","De-regionalized (Steubing et al 2022)"]
["Ecoinvent","Wind","WI","Unknown",14.30770754203248,"g/kWh","De-regionalized (Steubing et al 2022)"]
["Ecoinvent","Wind","WI","Unknown",23.898170690157603,"g/kWh","De-regionalized (Steubing et al 2022)"]
["Ecoinvent","Wind","WI","Unknown",15.00660763015428,"g/kWh","De-regionalized (Steubing et al 2022)"]
["Ecoinvent","Oil","OI","Unknown",1307.576059302617,"g/kWh","De-regionalized (Steubing et al 2022)"]
["Ecoinvent","Oil","OI","Unknown",877.0242229804668,"g/kWh","De-regionalized (Steubing et al 2022)"]
["Ecoinvent","Oil","OI","Unknown",1155.1045283858841,"g/kWh","De-regionalized (Steubing et al 2022)"]
["Ecoinvent","Oil","OI","Unknown",958.6785019911307,"g/kWh","De-regionalized (Steubing et al 2022)"]
["Ecoinvent","Oil","OI","Unknown",913.2530766569525,"g/kWh","De-regionalized (Steubing et al 2022)"]
["Ecoinvent","Oil","OI","Unknown",853.9067837152991,"g/kWh","De-regionalized (Steubing et al 2022)"]
["Ecoinvent","Oil","OI","Unknown",1062.906526499017,"g/kWh","De-regionalized (Steubing et al 2022)"]
["Ecoinvent","Oil","OI","Unknown",727.145187966124,"g/kWh","De-regionalized (Steubing et al 2022)"]
["Ecoinvent","Oil","OI","Unknown",782.7176447588862,"g/kWh","De-regionalized (Steubing et al 2022)"]
["Ecoinvent","Oil","OI","Unknown",1668.426396874217,"g/kWh","De-regionalized (Steubing et al 2022)"]
["Ecoinvent","Oil","OI","Unknown",964.3796110033671,"g/kWh","De-regionalized (Steubing et al 2022)"]
["Ecoinvent","Oil","OI","Unknown",1097.068414198559,"g/kWh","De-regionalized (Steubing et al 2022)"]
["Ecoinvent","Oil","OI","Unknown",1097.06841419856,"g/kWh","De-regionalized (Steubing et al 2022)"]
["Ecoinvent","Oil","OI","Unknown",1097.068414198559,"g/kWh","De-regionalized (Steubing et al 2022)"]
["Ecoinvent","Oil","OI","Unknown",1097.068414198559,"g/kWh","De-regionalized (Steubing et al 2022)"]
["Ecoinvent","Oil","OI","Unknown",1097.068414198559,"g/kWh","De-regionalized (Steubing et al 2022)"]
["Ecoinvent","Oil","OI","Unknown",1097.068414198559,"g/kWh","De-regionalized (Steubing et al 2022)"]
["Ecoinvent","Oil","OI","Unknown",1097.06841419856,"g/kWh","De-regionalized (Steubing et al 2022)"]
["Ecoinvent","Oil","OI","Unknown",1097.06841419856,"g/kWh","De-regionalized (Steubing et al 2022)"]
["Ecoinvent","Oil","OI","Unknown",1097.06841419856,"g/kWh","De-regionalized (Steubing et al 2022)"]
["Ecoinvent","Oil","OI","Unknown",1097.068414198559,"g/kWh","De-regionalized (Steubing et al 2022)"]
["Ecoinvent","Oil","OI","Unknown",1097.076537114895,"g/kWh","De-regionalized (Steubing et al 2022)"]
["Ecoinvent","Oil","OI","Unknown",1097.068414198559,"g/kWh","De-regionalized (Steubing et al 2022)"]
["Ecoinvent","Oil","OI","Unknown",1097.068414198559,"g/kWh","De-regionalized (Steubing et al 2022)"]
["Ecoinvent","Oil","OI","Unknown",908.5976868460158,"g/kWh","De-regionalized (Steubing et al 2022)"]
["Ecoinvent","Oil","OI","Unknown",851.810340474045,"g/kWh","De-regionalized (Steubing et al 2022)"]
["Ecoinvent","Oil","OI","Unknown",1221.9072401346189,"g/kWh","De-regionalized (Steubing et al 2022)"]
["Ecoinvent","Oil","OI","Unknown",957.7110626200425,"g/kWh","De-regionalized (Steubing et al 2022)"]
["Ecoinvent","Oil","OI","Unknown",957.7110626200421,"g/kWh","De-regionalized (Steubing et al 2022)"]
["Ecoinvent","Oil","OI","Unknown",1073.797254725986,"g/kWh","De-regionalized (Steubing et al 2022)"]
["Ecoinvent","Oil","OI","Unknown",1073.797254725986,"g/kWh","De-regionalized (Steubing et al 2022)"]
["Ecoinvent","Oil","OI","Unknown",1073.797254725986,"g/kWh","De-regionalized (Steubing et al 2022)"]
["Ecoinvent","Oil","OI","Unknown",1042.215011513034,"g/kWh","De-regionalized (Steubing et al 2022)"]
["Ecoinvent","Oil","OI","Unknown",1143.074509173628,"g/kWh","De-regionalized (Steubing et al 2022)"]
["Ecoinvent","Oil","OI","Unknown",1107.3534017690629,"g/kWh","De-regionalized (Steubing et al 2022)"]
["Ecoinvent","Oil","OI","Unknown",1362.8965296576362,"g/kWh","De-regionalized (Steubing et al 2022)"]
["Ecoinvent","Oil","OI","Unknown",1073.797254725986,"g/kWh","De-regionalized (Steubing et al 2022)"]
["Ecoinvent","Oil","OI","Unknown",1042.215011513034,"g/kWh","De-regionalized (Steubing et al 2022)"]
["Ecoinvent","Oil","OI","Unknown",1417.4124012976629,"g/kWh","De-regionalized (Steubing et al 2022)"]
["Ecoinvent","Oil","OI","Unknown",932.508153803219,"g/kWh","De-regionalized (Steubing et al 2022)"]
["Ecoinvent","Oil","OI","Unknown",1042.215011513034,"g/kWh","De-regionalized (Steubing et al 2022)"]
["Ecoinvent","Oil","OI","Unknown",1221.9072401346189,"g/kWh","De-regionalized (Steubing et al 2022)"]
["Ecoinvent","Oil","OI","Unknown",1540.6656599744979,"g/kWh","De-regionalized (Steubing et al 2022)"]
["Ecoinvent","Oil","OI","Unknown",1181.176971459477,"g/kWh","De-regionalized (Steubing et al 2022)"]
["Ecoinvent","Oil","OI","Unknown",1181.176971459478,"g/kWh","De-regionalized (Steubing et al 2022)"]
["Ecoinvent","Oil","OI","Unknown",1012.437397345751,"g/kWh","De-regionalized (Steubing et al 2022)"]
["Ecoinvent","Oil","OI","Unknown",1143.074509173627,"g/kWh","De-regionalized (Steubing et al 2022)"]
["Ecoinvent","Oil","OI","Unknown",1073.797254725986,"g/kWh","De-regionalized (Steubing et al 2022)"]
["Ecoinvent","Oil","OI","Unknown",885.8827509787483,"g/kWh","De-regionalized (Steubing et al 2022)"]
["Ecoinvent","Oil","OI","Unknown",1181.176971459478,"g/kWh","De-regionalized (Steubing et al 2022)"]
["Ecoinvent","Oil","OI","Unknown",1042.215011513034,"g/kWh","De-regionalized (Steubing et al 2022)"]
["Ecoinvent","Oil","OI","Unknown",1107.353401769064,"g/kWh","De-regionalized (Steubing et al 2022)"]
["Ecoinvent","Oil","OI","Unknown",1086.9726578079951,"g/kWh","De-regionalized (Steubing et al 2022)"]
["Ecoinvent","Oil","OI","Unknown",1540.665659974499,"g/kWh","De-regionalized (Steubing et al 2022)"]
["Ecoinvent","Oil","OI","Unknown",885.8827509787486,"g/kWh","De-regionalized (Steubing et al 2022)"]
["Ecoinvent","Oil","OI","Unknown",1070.553180811769,"g/kWh","De-regionalized (Steubing et al 2022)"]
["Ecoinvent","Oil","OI","Unknown",1064.60430802116,"g/kWh","De-regionalized (Steubing et al 2022)"]
["Ecoinvent","Oil","OI","Unknown",1522.3730240677248,"g/kWh","De-regionalized (Steubing et al 2022)"]
["Ecoinvent","Oil","OI","Unknown",1240.614448708452,"g/kWh","De-regionalized (Steubing et al 2022)"]
["Ecoinvent","Oil","OI","Unknown",965.11979840348,"g/kWh","De-regionalized (Steubing et al 2022)"]
["Ecoinvent","Oil","OI","Unknown",1183.810142826224,"g/kWh","De-regionalized (Steubing et al 2022)"]
["Ecoinvent","Oil","OI","Unknown",873.2945180600274,"g/kWh","De-regionalized (Steubing et al 2022)"]
["Ecoinvent","Oil","OI","Unknown",446.809471782271,"g/kWh","De-regionalized (Steubing et al 2022)"]
["Ecoinvent","Oil","OI","Unknown",951.4932780185507,"g/kWh","De-regionalized (Steubing et al 2022)"]
["Ecoinvent","Oil","OI","Unknown",953.136657929534,"g/kWh","De-regionalized (Steubing et al 2022)"]
["Ecoinvent","Oil","OI","Unknown",769.63661965203,"g/kWh","De-regionalized (Steubing et al 2022)"]
["Ecoinvent","Oil","OI","Unknown",1264.153603561703,"g/kWh","De-regionalized (Steubing et al 2022)"]
["Ecoinvent","Oil","OI","Unknown",876.7809904741217,"g/kWh","De-regionalized (Steubing et al 2022)"]
["Ecoinvent","Oil","OI","Unknown",679.9165455217892,"g/kWh","De-regionalized (Steubing et al 2022)"]
["Ecoinvent","Oil","OI","Unknown",992.4845184497643,"g/kWh","De-regionalized (Steubing et al 2022)"]
["Ecoinvent","Oil","OI","Unknown",1075.30113832341,"g/kWh","De-regionalized (Steubing et al 2022)"]
["Ecoinvent","Oil","OI","Unknown",1130.653498469349,"g/kWh","De-regionalized (Steubing et al 2022)"]
["Ecoinvent","Oil","OI","Unknown",873.2945180600276,"g/kWh","De-regionalized (Steubing et al 2022)"]
["Ecoinvent","Oil","OI","Unknown",960.0239960296987,"g/kWh","De-regionalized (Steubing et al 2022)"]
["Ecoinvent","Oil","OI","Unknown",814.5362855549882,"g/kWh","De-regionalized (Steubing et al 2022)"]
["Ecoinvent","Oil","OI","Unknown",730.0140457098303,"g/kWh","De-regionalized (Steubing et al 2022)"]
["Ecoinvent","Oil","OI","Unknown",693.9478181289942,"g/kWh","De-regionalized (Steubing et al 2022)"]
["Ecoinvent","Oil","OI","Unknown",765.3638617129382,"g/kWh","De-regionalized (Steubing et al 2022)"]
["Ecoinvent","Oil","OI","Unknown",1247.7221260395052,"g/kWh","De-regionalized (Steubing et al 2022)"]
["Ecoinvent","Oil","OI","Unknown",919.1147422443684,"g/kWh","De-regionalized (Steubing et al 2022)"]
["Ecoinvent","Oil","OI","Unknown",750.860984650536,"g/kWh","De-regionalized (Steubing et al 2022)"]
["Ecoinvent","Oil","OI","Unknown",1058.211662135353,"g/kWh","De-regionalized (Steubing et al 2022)"]
["Ecoinvent","Oil","OI","Unknown",904.0294395975426,"g/kWh","De-regionalized (Steubing et al 2022)"]
["Ecoinvent","Oil","OI","Unknown",828.6012797732554,"g/kWh","De-regionalized (Steubing et al 2022)"]
["Ecoinvent","Oil","OI","Unknown",2756.057874355903,"g/kWh","De-regionalized (Steubing et al 2022)"]
["Ecoinvent","Oil","OI","Unknown",1529.185250073264,"g/kWh","De-regionalized (Steubing et al 2022)"]
["Ecoinvent","Oil","OI","Unknown",2756.057874355904,"g/kWh","De-regionalized (Steubing et al 2022)"]
["Ecoinvent","Oil","OI","Unknown",1529.185250073264,"g/kWh","De-regionalized (Steubing et al 2022)"]
["Ecoinvent","Oil","OI","Unknown",858.3343640469291,"g/kWh","De-regionalized (Steubing et al 2022)"]
["Ecoinvent","Oil","OI","Unknown",628.6717257979823,"g/kWh","De-regionalized (Steubing et al 2022)"]
["Ecoinvent","Oil","OI","Unknown",1220.6761824106811,"g/kWh","De-regionalized (Steubing et al 2022)"]
["Ecoinvent","Oil","OI","Unknown",995.3738794334378,"g/kWh","De-regionalized (Steubing et al 2022)"]
["Ecoinvent","Oil","OI","Unknown",795.9378598022255,"g/kWh","De-regionalized (Steubing et al 2022)"]
["Ecoinvent","Oil","OI","Unknown",1076.052526593998,"g/kWh","De-regionalized (Steubing et al 2022)"]
["Ecoinvent","Oil","OI","Unknown",485.3591091227021,"g/kWh","De-regionalized (Steubing et al 2022)"]
["Ecoinvent","Oil","OI","Unknown",858.3343640469288,"g/kWh","De-regionalized (Steubing et al 2022)"]
["Ecoinvent","Oil","OI","Unknown",880.1437992487429,"g/kWh","De-regionalized (Steubing et al 2022)"]
["Ecoinvent","Oil","OI","Unknown",833.6060646003427,"g/kWh","De-regionalized (Steubing et al 2022)"]
["Ecoinvent","Oil","OI","Unknown",610.222986703986,"g/kWh","De-regionalized (Steubing et al 2022)"]
["Ecoinvent","Oil","OI","Unknown",999.363767645239,"g/kWh","De-regionalized (Steubing et al 2022)"]
["Ecoinvent","Oil","OI","Unknown",1257.229273370785,"g/kWh","De-regionalized (Steubing et al 2022)"]
["Ecoinvent","Oil","OI","Unknown",1687.3957378130199,"g/kWh","De-regionalized (Steubing et al 2022)"]
["Ecoinvent","Oil","OI","Unknown",1155.685230836285,"g/kWh","De-regionalized (Steubing et al 2022)"]
["Ecoinvent","Oil","OI","Unknown",960.3152341292714,"g/kWh","De-regionalized (Steubing et al 2022)"]
["Ecoinvent","Oil","OI","Unknown",1396.539866233093,"g/kWh","De-regionalized (Steubing et al 2022)"]
["Ecoinvent","Oil","OI","Unknown",1386.669494920802,"g/kWh","De-regionalized (Steubing et al 2022)"]
["Ecoinvent","Oil","OI","Unknown",873.2945180600268,"g/kWh","De-regionalized (Steubing et al 2022)"]
["Ecoinvent","Oil","OI","Unknown",1097.068414198559,"g/kWh","De-regionalized (Steubing et al 2022)"]
["Ecoinvent","Oil","OI","Unknown",1051.492864734609,"g/kWh","De-regionalized (Steubing et al 2022)"]
["Ecoinvent","Oil","OI","Unknown",1420.502490204294,"g/kWh","De-regionalized (Steubing et al 2022)"]
["Ecoinvent","Oil","OI","Unknown",866.1441998317262,"g/kWh","De-regionalized (Steubing et al 2022)"]
["Ecoinvent","Oil","OI","Unknown",599.5151030383586,"g/kWh","De-regionalized (Steubing et al 2022)"]
["Ecoinvent","Oil","OI","Unknown",854.188389346198,"g/kWh","De-regionalized (Steubing et al 2022)"]
["Ecoinvent","Oil","OI","Unknown",836.8798710029854,"g/kWh","De-regionalized (Steubing et al 2022)"]
["Ecoinvent","Oil","OI","Unknown",694.8193934738246,"g/kWh","De-regionalized (Steubing et al 2022)"]
["Ecoinvent","Oil","OI","Unknown",131.3666548575215,"g/kWh","De-regionalized (Steubing et al 2022)"]
["Ecoinvent","Oil","OI","Unknown",947.4681556781052,"g/kWh","De-regionalized (Steubing et al 2022)"]
["Ecoinvent","Oil","OI","Unknown",1063.153213951124,"g/kWh","De-regionalized (Steubing et al 2022)"]
["Ecoinvent","Oil","OI","Unknown",1322.284930573792,"g/kWh","De-regionalized (Steubing et al 2022)"]
["Ecoinvent","Oil","OI","Unknown",650.8701693026148,"g/kWh","De-regionalized (Steubing et al 2022)"]
["Ecoinvent","Oil","OI","Unknown",862.1729983439578,"g/kWh","De-regionalized (Steubing et al 2022)"]
["Ecoinvent","Oil","OI","Unknown",644.7761889120725,"g/kWh","De-regionalized (Steubing et al 2022)"]
["Ecoinvent","Oil","OI","Unknown",1060.9373867979011,"g/kWh","De-regionalized (Steubing et al 2022)"]
["Ecoinvent","Oil","OI","Unknown",913.2546270851926,"g/kWh","De-regionalized (Steubing et al 2022)"]
["Ecoinvent","Oil","OI","Unknown",960.3065222129499,"g/kWh","De-regionalized (Steubing et al 2022)"]
["Ecoinvent","Oil","OI","Unknown",684.7587826849721,"g/kWh","De-regionalized (Steubing et al 2022)"]
["Ecoinvent","Oil","OI","Unknown",1312.418827374672,"g/kWh","De-regionalized (Steubing et al 2022)"]
["Ecoinvent","Oil","OI","Unknown",841.7875350553618,"g/kWh","De-regionalized (Steubing et al 2022)"]
["Ecoinvent","Oil","OI","Unknown",1221.907240134618,"g/kWh","De-regionalized (Steubing et al 2022)"]
["Ecoinvent","Oil","OI","Unknown",757.8568249604034,"g/kWh","De-regionalized (Steubing et al 2022)"]
["Ecoinvent","Oil","OI","Unknown",1265.5467960773442,"g/kWh","De-regionalized (Steubing et al 2022)"]
["Ecoinvent","Oil","OI","Unknown",729.8709959870463,"g/kWh","De-regionalized (Steubing et al 2022)"]
["Ecoinvent","Oil","OI","Unknown",1064.123399362415,"g/kWh","De-regionalized (Steubing et al 2022)"]
["Ecoinvent","Oil","OI","Unknown",926.7107014075738,"g/kWh","De-regionalized (Steubing et al 2022)"]
["Ecoinvent","Oil","OI","Unknown",1789.662078444736,"g/kWh","De-regionalized (Steubing et al 2022)"]
["Ecoinvent","Oil","OI","Unknown",760.7020704620827,"g/kWh","De-regionalized (Steubing et al 2022)"]
["Ecoinvent","Oil","OI","Unknown",1139.399036409001,"g/kWh","De-regionalized (Steubing et al 2022)"]
["Ecoinvent","Oil","OI","Unknown",1000.7161761702199,"g/kWh","De-regionalized (Steubing et al 2022)"]
["Ecoinvent","Oil","OI","Unknown",1925.832014380538,"g/kWh","De-regionalized (Steubing et al 2022)"]
["Ecoinvent","Oil","OI","Unknown",751.1104544790543,"g/kWh","De-regionalized (Steubing et al 2022)"]
["Ecoinvent","Oil","OI","Unknown",1021.190457592375,"g/kWh","De-regionalized (Steubing et al 2022)"]
["Ecoinvent","Oil","OI","Unknown",957.7110626200421,"g/kWh","De-regionalized (Steubing et al 2022)"]
["Ecoinvent","Oil","OI","Unknown",952.5620902616989,"g/kWh","De-regionalized (Steubing et al 2022)"]
["Ecoinvent","Oil","OI","Unknown",1357.674741253129,"g/kWh","De-regionalized (Steubing et al 2022)"]
["Ecoinvent","Oil","OI","Unknown",1288.556763164347,"g/kWh","De-regionalized (Steubing et al 2022)"]
["Ecoinvent","Oil","OI","Unknown",1102.4231558274041,"g/kWh","De-regionalized (Steubing et al 2022)"]
["Ecoinvent","Oil","OI","Unknown",1175.91804256417,"g/kWh","De-regionalized (Steubing et al 2022)"]
["Ecoinvent","Oil","OI","Unknown",1017.0254486420049,"g/kWh","De-regionalized (Steubing et al 2022)"]
["Ecoinvent","Oil","OI","Unknown",886.0719021890258,"g/kWh","De-regionalized (Steubing et al 2022)"]
["Ecoinvent","Oil","OI","Unknown",1378.028937177951,"g/kWh","De-regionalized (Steubing et al 2022)"]
["Ecoinvent","Oil","OI","Unknown",1147.641815021353,"g/kWh","De-regionalized (Steubing et al 2022)"]
["Ecoinvent","Oil","OI","Unknown",1464.2690358615791,"g/kWh","De-regionalized (Steubing et al 2022)"]
["Ecoinvent","Oil","OI","Unknown",1270.0828232981669,"g/kWh","De-regionalized (Steubing et al 2022)"]
["Ecoinvent","Oil","OI","Unknown",1185.127385790355,"g/kWh","De-regionalized (Steubing et al 2022)"]
["Ecoinvent","Oil","OI","Unknown",181.56258542065558,"g/kWh","De-regionalized (Steubing et al 2022)"]
["Ecoinvent","Biomass and waste","BW","Unknown",171.8730524484979,"g/kWh","De-regionalized (Steubing et al 2022)"]
["Ecoinvent","Biomass and waste","BW","Unknown",46.56249658695295,"g/kWh","De-regionalized (Steubing et al 2022)"]
["Ecoinvent","Biomass and waste","BW","Unknown",0,"g/kWh","De-regionalized (Steubing et al 2022)"]
["Ecoinvent","Biomass and waste","BW","Unknown",172.1085847000146,"g/kWh","De-regionalized (Steubing et al 2022)"]
["Ecoinvent","Biomass and waste","BW","Unknown",49.04978252515545,"g/kWh","De-regionalized (Steubing et al 2022)"]
["Ecoinvent","Biomass and waste","BW","Unknown",0,"g/kWh","De-regionalized (Steubing et al 2022)"]
["Ecoinvent","Biomass and waste","BW","Unknown",172.1085847000146,"g/kWh","De-regionalized (Steubing et al 2022)"]
["Ecoinvent","Biomass and waste","BW","Unknown",49.04978252515544,"g/kWh","De-regionalized (Steubing et al 2022)"]
["Ecoinvent","Biomass and waste","BW","Unknown",84.39630846488582,"g/kWh","De-regionalized (Steubing et al 2022)"]
["Ecoinvent","Biomass and waste","BW","Unknown",220.4818021561738,"g/kWh","De-regionalized (Steubing et al 2022)"]
["Ecoinvent","Biomass and waste","BW","Unknown",171.8730524484979,"g/kWh","De-regionalized (Steubing et al 2022)"]
["Ecoinvent","Biomass and waste","BW","Unknown",46.56249658695296,"g/kWh","De-regionalized (Steubing et al 2022)"]
["Ecoinvent","Biomass and waste","BW","Unknown",410.9101001728393,"g/kWh","De-regionalized (Steubing et al 2022)"]
["Ecoinvent","Biomass and waste","BW","Unknown",4.722226580304845,"g/kWh","De-regionalized (Steubing et al 2022)"]
["Ecoinvent","Biomass and waste","BW","Unknown",171.8730524484979,"g/kWh","De-regionalized (Steubing et al 2022)"]
["Ecoinvent","Biomass and waste","BW","Unknown",46.56249658695293,"g/kWh","De-regionalized (Steubing et al 2022)"]
["Ecoinvent","Biomass and waste","BW","Unknown",46.56249658695295,"g/kWh","De-regionalized (Steubing et al 2022)"]
["Ecoinvent","Biomass and waste","BW","Unknown",4.722226580304845,"g/kWh","De-regionalized (Steubing et al 2022)"]
["Ecoinvent","Biomass and waste","BW","Unknown",171.8730524484979,"g/kWh","De-regionalized (Steubing et al 2022)"]
["Ecoinvent","Biomass and waste","BW","Unknown",4.722226580304845,"g/kWh","De-regionalized (Steubing et al 2022)"]
["Ecoinvent","Biomass and waste","BW","Unknown",171.8730524484979,"g/kWh","De-regionalized (Steubing et al 2022)"]
["Ecoinvent","Biomass and waste","BW","Unknown",46.56249658695295,"g/kWh","De-regionalized (Steubing et al 2022)"]
["Ecoinvent","Biomass and waste","BW","Unknown",4.722226580304845,"g/kWh","De-regionalized (Steubing et al 2022)"]
["Ecoinvent","Biomass and waste","BW","Unknown",171.8730524484979,"g/kWh","De-regionalized (Steubing et al 2022)"]
["Ecoinvent","Biomass and waste","BW","Unknown",46.56249658695294,"g/kWh","De-regionalized (Steubing et al 2022)"]
["Ecoinvent","Biomass and waste","BW","Unknown",4.722226580304845,"g/kWh","De-regionalized (Steubing et al 2022)"]
["Ecoinvent","Biomass and waste","BW","Unknown",171.8730524484979,"g/kWh","De-regionalized (Steubing et al 2022)"]
["Ecoinvent","Biomass and waste","BW","Unknown",46.56249658695296,"g/kWh","De-regionalized (Steubing et al 2022)"]
["Ecoinvent","Biomass and waste","BW","Unknown",171.8730524484979,"g/kWh","De-regionalized (Steubing et al 2022)"]
["Ecoinvent","Biomass and waste","BW","Unknown",63.87277667527125,"g/kWh","De-regionalized (Steubing et al 2022)"]
["Ecoinvent","Biomass and waste","BW","Unknown",174.8208194820778,"g/kWh","De-regionalized (Steubing et al 2022)"]
["Ecoinvent","Biomass and waste","BW","Unknown",46.56249658695293,"g/kWh","De-regionalized (Steubing et al 2022)"]
["Ecoinvent","Biomass and waste","BW","Unknown",46.56249658695295,"g/kWh","De-regionalized (Steubing et al 2022)"]
["Ecoinvent","Biomass and waste","BW","Unknown",0,"g/kWh","De-regionalized (Steubing et al 2022)"]
["Ecoinvent","Biomass and waste","BW","Unknown",172.1085847000146,"g/kWh","De-regionalized (Steubing et al 2022)"]
["Ecoinvent","Biomass and waste","BW","Unknown",49.04978252515544,"g/kWh","De-regionalized (Steubing et al 2022)"]
["Ecoinvent","Biomass and waste","BW","Unknown",0,"g/kWh","De-regionalized (Steubing et al 2022)"]
["Ecoinvent","Biomass and waste","BW","Unknown",172.1085847000146,"g/kWh","De-regionalized (Steubing et al 2022)"]
["Ecoinvent","Biomass and waste","BW","Unknown",49.04978252515544,"g/kWh","De-regionalized (Steubing et al 2022)"]
["Ecoinvent","Biomass and waste","BW","Unknown",172.1085847000146,"g/kWh","De-regionalized (Steubing et al 2022)"]
["Ecoinvent","Biomass and waste","BW","Unknown",48.1227979747592,"g/kWh","De-regionalized (Steubing et al 2022)"]
["Ecoinvent","Biomass and waste","BW","Unknown",49.04978252515544,"g/kWh","De-regionalized (Steubing et al 2022)"]
["Ecoinvent","Biomass and waste","BW","Unknown",0,"g/kWh","De-regionalized (Steubing et al 2022)"]
["Ecoinvent","Biomass and waste","BW","Unknown",172.1085847000146,"g/kWh","De-regionalized (Steubing et al 2022)"]
["Ecoinvent","Biomass and waste","BW","Unknown",49.04978252515544,"g/kWh","De-regionalized (Steubing et al 2022)"]
["Ecoinvent","Biomass and waste","BW","Unknown",0,"g/kWh","De-regionalized (Steubing et al 2022)"]
["Ecoinvent","Biomass and waste","BW","Unknown",172.1085847000146,"g/kWh","De-regionalized (Steubing et al 2022)"]
["Ecoinvent","Biomass and waste","BW","Unknown",49.049782525155436,"g/kWh","De-regionalized (Steubing et al 2022)"]
["Ecoinvent","Biomass and waste","BW","Unknown",0,"g/kWh","De-regionalized (Steubing et al 2022)"]
["Ecoinvent","Biomass and waste","BW","Unknown",172.1085847000146,"g/kWh","De-regionalized (Steubing et al 2022)"]
["Ecoinvent","Biomass and waste","BW","Unknown",49.04978252515544,"g/kWh","De-regionalized (Steubing et al 2022)"]
["Ecoinvent","Biomass and waste","BW","Unknown",0,"g/kWh","De-regionalized (Steubing et al 2022)"]
["Ecoinvent","Biomass and waste","BW","Unknown",172.1085847000146,"g/kWh","De-regionalized (Steubing et al 2022)"]
["Ecoinvent","Biomass and waste","BW","Unknown",49.04978252515544,"g/kWh","De-regionalized (Steubing et al 2022)"]
["Ecoinvent","Biomass and waste","BW","Unknown",172.1085847000146,"g/kWh","De-regionalized (Steubing et al 2022)"]
["Ecoinvent","Biomass and waste","BW","Unknown",48.1227979747592,"g/kWh","De-regionalized (Steubing et al 2022)"]
["Ecoinvent","Biomass and waste","BW","Unknown",49.049782525155436,"g/kWh","De-regionalized (Steubing et al 2022)"]
["Ecoinvent","Biomass and waste","BW","Unknown",46.56249658695294,"g/kWh","De-regionalized (Steubing et al 2022)"]
["Ecoinvent","Biomass and waste","BW","Unknown",4.722226580304845,"g/kWh","De-regionalized (Steubing et al 2022)"]
["Ecoinvent","Biomass and waste","BW","Unknown",171.8730524484979,"g/kWh","De-regionalized (Steubing et al 2022)"]
["Ecoinvent","Biomass and waste","BW","Unknown",45.63551203655669,"g/kWh","De-regionalized (Steubing et al 2022)"]
["Ecoinvent","Biomass and waste","BW","Unknown",4.722226580304845,"g/kWh","De-regionalized (Steubing et al 2022)"]
["Ecoinvent","Biomass and waste","BW","Unknown",172.1085847000146,"g/kWh","De-regionalized (Steubing et al 2022)"]
["Ecoinvent","Biomass and waste","BW","Unknown",49.049782525155436,"g/kWh","De-regionalized (Steubing et al 2022)"]
["Ecoinvent","Biomass and waste","BW","Unknown",0,"g/kWh","De-regionalized (Steubing et al 2022)"]
["Ecoinvent","Biomass and waste","BW","Unknown",172.1085847000146,"g/kWh","De-regionalized (Steubing et al 2022)"]
["Ecoinvent","Biomass and waste","BW","Unknown",49.04978252515544,"g/kWh","De-regionalized (Steubing et al 2022)"]
["Ecoinvent","Biomass and waste","BW","Unknown",0,"g/kWh","De-regionalized (Steubing et al 2022)"]
["Ecoinvent","Biomass and waste","BW","Unknown",46.56249658695297,"g/kWh","De-regionalized (Steubing et al 2022)"]
["Ecoinvent","Biomass and waste","BW","Unknown",172.1085847000146,"g/kWh","De-regionalized (Steubing et al 2022)"]
["Ecoinvent","Biomass and waste","BW","Unknown",48.122797974759216,"g/kWh","De-regionalized (Steubing et al 2022)"]
["Ecoinvent","Biomass and waste","BW","Unknown",49.04978252515544,"g/kWh","De-regionalized (Steubing et al 2022)"]
["Ecoinvent","Biomass and waste","BW","Unknown",172.1085847000146,"g/kWh","De-regionalized (Steubing et al 2022)"]
["Ecoinvent","Biomass and waste","BW","Unknown",48.1227979747592,"g/kWh","De-regionalized (Steubing et al 2022)"]
["Ecoinvent","Biomass and waste","BW","Unknown",171.8730524484979,"g/kWh","De-regionalized (Steubing et al 2022)"]
["Ecoinvent","Biomass and waste","BW","Unknown",45.635512036556676,"g/kWh","De-regionalized (Steubing et al 2022)"]
["Ecoinvent","Biomass and waste","BW","Unknown",0,"g/kWh","De-regionalized (Steubing et al 2022)"]
["Ecoinvent","Biomass and waste","BW","Unknown",172.1085847000146,"g/kWh","De-regionalized (Steubing et al 2022)"]
["Ecoinvent","Biomass and waste","BW","Unknown",49.04978252515544,"g/kWh","De-regionalized (Steubing et al 2022)"]
["Ecoinvent","Biomass and waste","BW","Unknown",0,"g/kWh","De-regionalized (Steubing et al 2022)"]
["Ecoinvent","Biomass and waste","BW","Unknown",172.1085847000146,"g/kWh","De-regionalized (Steubing et al 2022)"]
["Ecoinvent","Biomass and waste","BW","Unknown",49.04978252515544,"g/kWh","De-regionalized (Steubing et al 2022)"]
["Ecoinvent","Biomass and waste","BW","Unknown",0,"g/kWh","De-regionalized (Steubing et al 2022)"]
["Ecoinvent","Biomass and waste","BW","Unknown",172.1085847000146,"g/kWh","De-regionalized (Steubing et al 2022)"]
["Ecoinvent","Biomass and waste","BW","Unknown",49.049782525155436,"g/kWh","De-regionalized (Steubing et al 2022)"]
["Ecoinvent","Biomass and waste","BW","Unknown",0,"g/kWh","De-regionalized (Steubing et al 2022)"]
["Ecoinvent","Biomass and waste","BW","Unknown",172.1085847000146,"g/kWh","De-regionalized (Steubing et al 2022)"]
["Ecoinvent","Biomass and waste","BW","Unknown",49.04978252515544,"g/kWh","De-regionalized (Steubing et al 2022)"]
["Ecoinvent","Biomass and waste","BW","Unknown",172.1085847000146,"g/kWh","De-regionalized (Steubing et al 2022)"]
["Ecoinvent","Biomass and waste","BW","Unknown",49.04978252515544,"g/kWh","De-regionalized (Steubing et al 2022)"]
["Ecoinvent","Biomass and waste","BW","Unknown",0,"g/kWh","De-regionalized (Steubing et al 2022)"]
["Ecoinvent","Biomass and waste","BW","Unknown",45.635512036556676,"g/kWh","De-regionalized (Steubing et al 2022)"]
["Ecoinvent","Biomass and waste","BW","Unknown",46.56249658695295,"g/kWh","De-regionalized (Steubing et al 2022)"]
["Ecoinvent","Biomass and waste","BW","Unknown",0,"g/kWh","De-regionalized (Steubing et al 2022)"]
["Ecoinvent","Biomass and waste","BW","Unknown",172.1085847000146,"g/kWh","De-regionalized (Steubing et al 2022)"]
["Ecoinvent","Biomass and waste","BW","Unknown",49.049782525155436,"g/kWh","De-regionalized (Steubing et al 2022)"]
["Ecoinvent","Biomass and waste","BW","Unknown",4.722226580304845,"g/kWh","De-regionalized (Steubing et al 2022)"]
["Ecoinvent","Biomass and waste","BW","Unknown",172.1085847000146,"g/kWh","De-regionalized (Steubing et al 2022)"]
["Ecoinvent","Biomass and waste","BW","Unknown",49.04978252515545,"g/kWh","De-regionalized (Steubing et al 2022)"]
["Ecoinvent","Biomass and waste","BW","Unknown",45.63551203655669,"g/kWh","De-regionalized (Steubing et al 2022)"]
["Ecoinvent","Biomass and waste","BW","Unknown",46.56249658695294,"g/kWh","De-regionalized (Steubing et al 2022)"]
["Ecoinvent","Biomass and waste","BW","Unknown",0,"g/kWh","De-regionalized (Steubing et al 2022)"]
["Ecoinvent","Biomass and waste","BW","Unknown",171.8730524484979,"g/kWh","De-regionalized (Steubing et al 2022)"]
["Ecoinvent","Biomass and waste","BW","Unknown",46.56249658695296,"g/kWh","De-regionalized (Steubing et al 2022)"]
["Ecoinvent","Biomass and waste","BW","Unknown",0,"g/kWh","De-regionalized (Steubing et al 2022)"]
["Ecoinvent","Biomass and waste","BW","Unknown",172.1085847000146,"g/kWh","De-regionalized (Steubing et al 2022)"]
["Ecoinvent","Biomass and waste","BW","Unknown",49.04978252515544,"g/kWh","De-regionalized (Steubing et al 2022)"]
["Ecoinvent","Biomass and waste","BW","Unknown",0,"g/kWh","De-regionalized (Steubing et al 2022)"]
["Ecoinvent","Biomass and waste","BW","Unknown",156.6871325800939,"g/kWh","De-regionalized (Steubing et al 2022)"]
["Ecoinvent","Biomass and waste","BW","Unknown",172.1085847000146,"g/kWh","De-regionalized (Steubing et al 2022)"]
["Ecoinvent","Biomass and waste","BW","Unknown",49.049782525155436,"g/kWh","De-regionalized (Steubing et al 2022)"]
["Ecoinvent","Biomass and waste","BW","Unknown",450.3339965233336,"g/kWh","De-regionalized (Steubing et al 2022)"]
["Ecoinvent","Biomass and waste","BW","Unknown",422.23485930804526,"g/kWh","De-regionalized (Steubing et al 2022)"]
["Ecoinvent","Biomass and waste","BW","Unknown",362.4320556866109,"g/kWh","De-regionalized (Steubing et al 2022)"]
["Ecoinvent","Biomass and waste","BW","Unknown",323.0819066840028,"g/kWh","De-regionalized (Steubing et al 2022)"]
["Ecoinvent","Biomass and waste","BW","Unknown",3.861424273943149,"g/kWh","De-regionalized (Steubing et al 2022)"]
["Ecoinvent","Biomass and waste","BW","Unknown",148.4031269299744,"g/kWh","De-regionalized (Steubing et al 2022)"]
["Ecoinvent","Biomass and waste","BW","Unknown",172.1854872009152,"g/kWh","De-regionalized (Steubing et al 2022)"]
["Ecoinvent","Biomass and waste","BW","Unknown",56.01098002802283,"g/kWh","De-regionalized (Steubing et al 2022)"]
["Ecoinvent","Biomass and waste","BW","Unknown",55.91933093629286,"g/kWh","De-regionalized (Steubing et al 2022)"]
["Ecoinvent","Biomass and waste","BW","Unknown",44.33909587257564,"g/kWh","De-regionalized (Steubing et al 2022)"]
["Ecoinvent","Biomass and waste","BW","Unknown",45.26608042297193,"g/kWh","De-regionalized (Steubing et al 2022)"]
["Ecoinvent","Biomass and waste","BW","Unknown",807.4693363430496,"g/kWh","De-regionalized (Steubing et al 2022)"]
["Ecoinvent","Biomass and waste","BW","Unknown",114.14365017663131,"g/kWh","De-regionalized (Steubing et al 2022)"]
["Ecoinvent","Biomass and waste","BW","Unknown",0,"g/kWh","De-regionalized (Steubing et al 2022)"]
["Ecoinvent","Biomass and waste","BW","Unknown",171.8730524484979,"g/kWh","De-regionalized (Steubing et al 2022)"]
["Ecoinvent","Biomass and waste","BW","Unknown",45.635512036556676,"g/kWh","De-regionalized (Steubing et al 2022)"]
["Ecoinvent","Biomass and waste","BW","Unknown",0,"g/kWh","De-regionalized (Steubing et al 2022)"]
["Ecoinvent","Biomass and waste","BW","Unknown",172.1085847000146,"g/kWh","De-regionalized (Steubing et al 2022)"]
["Ecoinvent","Biomass and waste","BW","Unknown",49.04978252515544,"g/kWh","De-regionalized (Steubing et al 2022)"]
["Ecoinvent","Biomass and waste","BW","Unknown",46.56249658695294,"g/kWh","De-regionalized (Steubing et al 2022)"]
["Ecoinvent","Biomass and waste","BW","Unknown",171.8730524484979,"g/kWh","De-regionalized (Steubing et al 2022)"]
["Ecoinvent","Biomass and waste","BW","Unknown",46.56249658695297,"g/kWh","De-regionalized (Steubing et al 2022)"]
["Ecoinvent","Biomass and waste","BW","Unknown",171.8730524484979,"g/kWh","De-regionalized (Steubing et al 2022)"]
["Ecoinvent","Biomass and waste","BW","Unknown",46.56249658695293,"g/kWh","De-regionalized (Steubing et al 2022)"]
["Ecoinvent","Biomass and waste","BW","Unknown",171.8730524484979,"g/kWh","De-regionalized (Steubing et al 2022)"]
["Ecoinvent","Biomass and waste","BW","Unknown",46.56249658695296,"g/kWh","De-regionalized (Steubing et al 2022)"]
["Ecoinvent","Biomass and waste","BW","Unknown",171.8730524484979,"g/kWh","De-regionalized (Steubing et al 2022)"]
["Ecoinvent","Biomass and waste","BW","Unknown",46.56249658695295,"g/kWh","De-regionalized (Steubing et al 2022)"]
["Ecoinvent","Biomass and waste","BW","Unknown",171.8730524484979,"g/kWh","De-regionalized (Steubing et al 2022)"]
["Ecoinvent","Biomass and waste","BW","Unknown",46.56249658695293,"g/kWh","De-regionalized (Steubing et al 2022)"]
["Ecoinvent","Biomass and waste","BW","Unknown",171.8730524484979,"g/kWh","De-regionalized (Steubing et al 2022)"]
["Ecoinvent","Biomass and waste","BW","Unknown",46.56249658695293,"g/kWh","De-regionalized (Steubing et al 2022)"]
["Ecoinvent","Biomass and waste","BW","Unknown",171.8730524484979,"g/kWh","De-regionalized (Steubing et al 2022)"]
["Ecoinvent","Biomass and waste","BW","Unknown",46.56249658695294,"g/kWh","De-regionalized (Steubing et al 2022)"]
["Ecoinvent","Biomass and waste","BW","Unknown",171.8730524484979,"g/kWh","De-regionalized (Steubing et al 2022)"]
["Ecoinvent","Biomass and waste","BW","Unknown",46.56249658695294,"g/kWh","De-regionalized (Steubing et al 2022)"]
["Ecoinvent","Biomass and waste","BW","Unknown",171.8730524484979,"g/kWh","De-regionalized (Steubing et al 2022)"]
["Ecoinvent","Biomass and waste","BW","Unknown",46.56249658695293,"g/kWh","De-regionalized (Steubing et al 2022)"]
["Ecoinvent","Biomass and waste","BW","Unknown",4.722226580304845,"g/kWh","De-regionalized (Steubing et al 2022)"]
["Ecoinvent","Biomass and waste","BW","Unknown",171.8730524484979,"g/kWh","De-regionalized (Steubing et al 2022)"]
["Ecoinvent","Biomass and waste","BW","Unknown",45.63551203655669,"g/kWh","De-regionalized (Steubing et al 2022)"]
["Ecoinvent","Biomass and waste","BW","Unknown",171.8730524484979,"g/kWh","De-regionalized (Steubing et al 2022)"]
["Ecoinvent","Biomass and waste","BW","Unknown",45.635512036556676,"g/kWh","De-regionalized (Steubing et al 2022)"]
["Ecoinvent","Biomass and waste","BW","Unknown",171.8730524484979,"g/kWh","De-regionalized (Steubing et al 2022)"]
["Ecoinvent","Biomass and waste","BW","Unknown",45.63551203655669,"g/kWh","De-regionalized (Steubing et al 2022)"]
["Ecoinvent","Biomass and waste","BW","Unknown",46.56249658695294,"g/kWh","De-regionalized (Steubing et al 2022)"]
["Ecoinvent","Biomass and waste","BW","Unknown",171.8730524484979,"g/kWh","De-regionalized (Steubing et al 2022)"]
["Ecoinvent","Biomass and waste","BW","Unknown",45.635512036556676,"g/kWh","De-regionalized (Steubing et al 2022)"]
["Ecoinvent","Biomass and waste","BW","Unknown",4.722226580304845,"g/kWh","De-regionalized (Steubing et al 2022)"]
["Ecoinvent","Biomass and waste","BW","Unknown",4.722226580304845,"g/kWh","De-regionalized (Steubing et al 2022)"]
["Ecoinvent","Biomass and waste","BW","Unknown",172.1085847000146,"g/kWh","De-regionalized (Steubing et al 2022)"]
["Ecoinvent","Biomass and waste","BW","Unknown",48.122797974759216,"g/kWh","De-regionalized (Steubing et al 2022)"]
["Ecoinvent","Biomass and waste","BW","Unknown",45.63551203655669,"g/kWh","De-regionalized (Steubing et al 2022)"]
["Ecoinvent","Biomass and waste","BW","Unknown",33.18895736371008,"g/kWh","De-regionalized (Steubing et al 2022)"]
["Ecoinvent","Biomass and waste","BW","Unknown",29.90089774245062,"g/kWh","De-regionalized (Steubing et al 2022)"]
["Ecoinvent","Biomass and waste","BW","Unknown",48.350675734378946,"g/kWh","De-regionalized (Steubing et al 2022)"]
["Ecoinvent","Biomass and waste","BW","Unknown",109.50488668625471,"g/kWh","De-regionalized (Steubing et al 2022)"]
["Ecoinvent","Biomass and waste","BW","Unknown",109.7527436626185,"g/kWh","De-regionalized (Steubing et al 2022)"]
["Ecoinvent","Solar","PV","Unknown",63.22499082039847,"g/kWh","De-regionalized (Steubing et al 2022)"]
["Ecoinvent","Solar","PV","Unknown",74.90090074083977,"g/kWh","De-regionalized (Steubing et al 2022)"]
["Ecoinvent","Solar","PV","Unknown",66.66254419317664,"g/kWh","De-regionalized (Steubing et al 2022)"]
["Ecoinvent","Solar","PV","Unknown",97.16617135454996,"g/kWh","De-regionalized (Steubing et al 2022)"]
["Ecoinvent","Solar","PV","Unknown",115.1105542114738,"g/kWh","De-regionalized (Steubing et al 2022)"]
["Ecoinvent","Solar","PV","Unknown",102.45141511010961,"g/kWh","De-regionalized (Steubing et al 2022)"]
["Ecoinvent","Solar","PV","Unknown",111.4321945773816,"g/kWh","De-regionalized (Steubing et al 2022)"]
["Ecoinvent","Solar","PV","Unknown",131.9893822120051,"g/kWh","De-regionalized (Steubing et al 2022)"]
["Ecoinvent","Solar","PV","Unknown",85.09839963610901,"g/kWh","De-regionalized (Steubing et al 2022)"]
["Ecoinvent","Solar","PV","Unknown",70.87414709792944,"g/kWh","De-regionalized (Steubing et al 2022)"]
["Ecoinvent","Solar","PV","Unknown",83.9629908019375,"g/kWh","De-regionalized (Steubing et al 2022)"]
["Ecoinvent","Solar","PV","Unknown",80.86494495576859,"g/kWh","De-regionalized (Steubing et al 2022)"]
["Ecoinvent","Solar","PV","Unknown",90.83437001858607,"g/kWh","De-regionalized (Steubing et al 2022)"]
["Ecoinvent","Solar","PV","Unknown",80.84348676798555,"g/kWh","De-regionalized (Steubing et al 2022)"]
["Ecoinvent","Solar","PV","Unknown",80.86494495576859,"g/kWh","De-regionalized (Steubing et al 2022)"]
["Ecoinvent","Solar","PV","Unknown",90.83437001858607,"g/kWh","De-regionalized (Steubing et al 2022)"]
["Ecoinvent","Solar","PV","Unknown",80.84348676798555,"g/kWh","De-regionalized (Steubing et al 2022)"]
["Ecoinvent","Solar","PV","Unknown",80.86494495576859,"g/kWh","De-regionalized (Steubing et al 2022)"]
["Ecoinvent","Solar","PV","Unknown",90.83437001858607,"g/kWh","De-regionalized (Steubing et al 2022)"]
["Ecoinvent","Solar","PV","Unknown",80.84348676798555,"g/kWh","De-regionalized (Steubing et al 2022)"]
["Ecoinvent","Solar","PV","Unknown",80.86494495576859,"g/kWh","De-regionalized (Steubing et al 2022)"]
["Ecoinvent","Solar","PV","Unknown",90.83437001858607,"g/kWh","De-regionalized (Steubing et al 2022)"]
["Ecoinvent","Solar","PV","Unknown",80.84348676798555,"g/kWh","De-regionalized (Steubing et al 2022)"]
["Ecoinvent","Solar","PV","Unknown",80.86494495576859,"g/kWh","De-regionalized (Steubing et al 2022)"]
["Ecoinvent","Solar","PV","Unknown",90.83437001858607,"g/kWh","De-regionalized (Steubing et al 2022)"]
["Ecoinvent","Solar","PV","Unknown",80.84348676798555,"g/kWh","De-regionalized (Steubing et al 2022)"]
["Ecoinvent","Solar","PV","Unknown",80.86494495576859,"g/kWh","De-regionalized (Steubing et al 2022)"]
["Ecoinvent","Solar","PV","Unknown",90.83437001858607,"g/kWh","De-regionalized (Steubing et al 2022)"]
["Ecoinvent","Solar","PV","Unknown",80.84348676798555,"g/kWh","De-regionalized (Steubing et al 2022)"]
["Ecoinvent","Solar","PV","Unknown",80.86494495576859,"g/kWh","De-regionalized (Steubing et al 2022)"]
["Ecoinvent","Solar","PV","Unknown",90.83437001858607,"g/kWh","De-regionalized (Steubing et al 2022)"]
["Ecoinvent","Solar","PV","Unknown",80.84348676798555,"g/kWh","De-regionalized (Steubing et al 2022)"]
["Ecoinvent","Solar","PV","Unknown",80.86494495576859,"g/kWh","De-regionalized (Steubing et al 2022)"]
["Ecoinvent","Solar","PV","Unknown",87.4171518197476,"g/kWh","De-regionalized (Steubing et al 2022)"]
["Ecoinvent","Solar","PV","Unknown",80.84348676798555,"g/kWh","De-regionalized (Steubing et al 2022)"]
["Ecoinvent","Solar","PV","Unknown",80.86494495576859,"g/kWh","De-regionalized (Steubing et al 2022)"]
["Ecoinvent","Solar","PV","Unknown",90.83437001858607,"g/kWh","De-regionalized (Steubing et al 2022)"]
["Ecoinvent","Solar","PV","Unknown",80.84348676798555,"g/kWh","De-regionalized (Steubing et al 2022)"]
["Ecoinvent","Solar","PV","Unknown",80.86226576679223,"g/kWh","De-regionalized (Steubing et al 2022)"]
["Ecoinvent","Solar","PV","Unknown",90.83191012417132,"g/kWh","De-regionalized (Steubing et al 2022)"]
["Ecoinvent","Solar","PV","Unknown",80.84347339767847,"g/kWh","De-regionalized (Steubing et al 2022)"]
["Ecoinvent","Solar","PV","Unknown",80.86494495576859,"g/kWh","De-regionalized (Steubing et al 2022)"]
["Ecoinvent","Solar","PV","Unknown",90.83437001858607,"g/kWh","De-regionalized (Steubing et al 2022)"]
["Ecoinvent","Solar","PV","Unknown",80.84348676798555,"g/kWh","De-regionalized (Steubing et al 2022)"]
["Ecoinvent","Solar","PV","Unknown",80.86494495576859,"g/kWh","De-regionalized (Steubing et al 2022)"]
["Ecoinvent","Solar","PV","Unknown",90.83437001858607,"g/kWh","De-regionalized (Steubing et al 2022)"]
["Ecoinvent","Solar","PV","Unknown",80.84348676798555,"g/kWh","De-regionalized (Steubing et al 2022)"]
["Ecoinvent","Solar","PV","Unknown",81.09820951331135,"g/kWh","De-regionalized (Steubing et al 2022)"]
["Ecoinvent","Solar","PV","Unknown",96.07480937861239,"g/kWh","De-regionalized (Steubing et al 2022)"]
["Ecoinvent","Solar","PV","Unknown",80.86494495576859,"g/kWh","De-regionalized (Steubing et al 2022)"]
["Ecoinvent","Solar","PV","Unknown",95.79846729907702,"g/kWh","De-regionalized (Steubing et al 2022)"]
["Ecoinvent","Solar","PV","Unknown",85.09840921694835,"g/kWh","De-regionalized (Steubing et al 2022)"]
["Ecoinvent","Solar","PV","Unknown",80.86494495576859,"g/kWh","De-regionalized (Steubing et al 2022)"]
["Ecoinvent","Solar","PV","Unknown",95.79846729907702,"g/kWh","De-regionalized (Steubing et al 2022)"]
["Ecoinvent","Solar","PV","Unknown",85.09840921694835,"g/kWh","De-regionalized (Steubing et al 2022)"]
["Ecoinvent","Solar","PV","Unknown",101.02912490417549,"g/kWh","De-regionalized (Steubing et al 2022)"]
["Ecoinvent","Solar","PV","Unknown",81.09820951331135,"g/kWh","De-regionalized (Steubing et al 2022)"]
["Ecoinvent","Solar","PV","Unknown",96.07480937861239,"g/kWh","De-regionalized (Steubing et al 2022)"]
["Ecoinvent","Solar","PV","Unknown",85.09840921694835,"g/kWh","De-regionalized (Steubing et al 2022)"]
["Ecoinvent","Solar","PV","Unknown",65.89229602318244,"g/kWh","De-regionalized (Steubing et al 2022)"]
["Ecoinvent","Solar","PV","Unknown",78.06078356068328,"g/kWh","De-regionalized (Steubing et al 2022)"]
["Ecoinvent","Solar","PV","Unknown",85.09840921694835,"g/kWh","De-regionalized (Steubing et al 2022)"]
["Ecoinvent","Solar","PV","Unknown",80.86494495576859,"g/kWh","De-regionalized (Steubing et al 2022)"]
["Ecoinvent","Solar","PV","Unknown",95.79846729907702,"g/kWh","De-regionalized (Steubing et al 2022)"]
["Ecoinvent","Solar","PV","Unknown",85.09840921694835,"g/kWh","De-regionalized (Steubing et al 2022)"]
["Ecoinvent","Solar","PV","Unknown",83.50706652982598,"g/kWh","De-regionalized (Steubing et al 2022)"]
["Ecoinvent","Solar","PV","Unknown",98.92851576852416,"g/kWh","De-regionalized (Steubing et al 2022)"]
["Ecoinvent","Solar","PV","Unknown",85.09840921694835,"g/kWh","De-regionalized (Steubing et al 2022)"]
["Ecoinvent","Solar","PV","Unknown",80.86494495576859,"g/kWh","De-regionalized (Steubing et al 2022)"]
["Ecoinvent","Solar","PV","Unknown",95.79846729907702,"g/kWh","De-regionalized (Steubing et al 2022)"]
["Ecoinvent","Solar","PV","Unknown",85.09840921694835,"g/kWh","De-regionalized (Steubing et al 2022)"]
["Ecoinvent","Solar","PV","Unknown",80.86494495576859,"g/kWh","De-regionalized (Steubing et al 2022)"]
["Ecoinvent","Solar","PV","Unknown",95.79846729907702,"g/kWh","De-regionalized (Steubing et al 2022)"]
["Ecoinvent","Solar","PV","Unknown",85.09840921694835,"g/kWh","De-regionalized (Steubing et al 2022)"]
["Ecoinvent","Solar","PV","Unknown",80.86494495576859,"g/kWh","De-regionalized (Steubing et al 2022)"]
["Ecoinvent","Solar","PV","Unknown",95.79846729907702,"g/kWh","De-regionalized (Steubing et al 2022)"]
["Ecoinvent","Solar","PV","Unknown",85.09840921694835,"g/kWh","De-regionalized (Steubing et al 2022)"]
["Ecoinvent","Solar","PV","Unknown",80.86494495576859,"g/kWh","De-regionalized (Steubing et al 2022)"]
["Ecoinvent","Solar","PV","Unknown",95.79846729907702,"g/kWh","De-regionalized (Steubing et al 2022)"]
["Ecoinvent","Solar","PV","Unknown",85.09840921694835,"g/kWh","De-regionalized (Steubing et al 2022)"]
["Ecoinvent","Solar","PV","Unknown",84.51115974351957,"g/kWh","De-regionalized (Steubing et al 2022)"]
["Ecoinvent","Solar","PV","Unknown",100.1180372716497,"g/kWh","De-regionalized (Steubing et al 2022)"]
["Ecoinvent","Solar","PV","Unknown",80.86494495576859,"g/kWh","De-regionalized (Steubing et al 2022)"]
["Ecoinvent","Solar","PV","Unknown",95.79846729907702,"g/kWh","De-regionalized (Steubing et al 2022)"]
["Ecoinvent","Solar","PV","Unknown",85.09840921694835,"g/kWh","De-regionalized (Steubing et al 2022)"]
["Ecoinvent","Solar","PV","Unknown",78.8244294814342,"g/kWh","De-regionalized (Steubing et al 2022)"]
["Ecoinvent","Solar","PV","Unknown",93.3811249627373,"g/kWh","De-regionalized (Steubing et al 2022)"]
["Ecoinvent","Solar","PV","Unknown",85.09840921694835,"g/kWh","De-regionalized (Steubing et al 2022)"]
["Ecoinvent","Solar","PV","Unknown",85.19408387714994,"g/kWh","De-regionalized (Steubing et al 2022)"]
["Ecoinvent","Solar","PV","Unknown",100.9270786346001,"g/kWh","De-regionalized (Steubing et al 2022)"]
["Ecoinvent","Solar","PV","Unknown",80.86494495576859,"g/kWh","De-regionalized (Steubing et al 2022)"]
["Ecoinvent","Solar","PV","Unknown",90.91701831748478,"g/kWh","De-regionalized (Steubing et al 2022)"]
["Ecoinvent","Solar","PV","Unknown",85.09840921694835,"g/kWh","De-regionalized (Steubing et al 2022)"]
["Ecoinvent","Solar","PV","Unknown",61.11749260821565,"g/kWh","De-regionalized (Steubing et al 2022)"]
["Ecoinvent","Solar","PV","Unknown",72.404205805061,"g/kWh","De-regionalized (Steubing et al 2022)"]
["Ecoinvent","Solar","PV","Unknown",85.09840921694835,"g/kWh","De-regionalized (Steubing et al 2022)"]
["Ecoinvent","Solar","PV","Unknown",59.81712177620604,"g/kWh","De-regionalized (Steubing et al 2022)"]
["Ecoinvent","Solar","PV","Unknown",70.86369238897079,"g/kWh","De-regionalized (Steubing et al 2022)"]
["Ecoinvent","Solar","PV","Unknown",85.09840921694835,"g/kWh","De-regionalized (Steubing et al 2022)"]
["Ecoinvent","Solar","PV","Unknown",57.76859073058878,"g/kWh","De-regionalized (Steubing et al 2022)"]
["Ecoinvent","Solar","PV","Unknown",68.43685422674906,"g/kWh","De-regionalized (Steubing et al 2022)"]
["Ecoinvent","Solar","PV","Unknown",85.09840921694835,"g/kWh","De-regionalized (Steubing et al 2022)"]
["Ecoinvent","Solar","PV","Unknown",77.37810792644572,"g/kWh","De-regionalized (Steubing et al 2022)"]
["Ecoinvent","Solar","PV","Unknown",91.66770775514154,"g/kWh","De-regionalized (Steubing et al 2022)"]
["Ecoinvent","Solar","PV","Unknown",85.09840921694835,"g/kWh","De-regionalized (Steubing et al 2022)"]
["Ecoinvent","Solar","PV","Unknown",80.86494495576859,"g/kWh","De-regionalized (Steubing et al 2022)"]
["Ecoinvent","Solar","PV","Unknown",95.79846729907702,"g/kWh","De-regionalized (Steubing et al 2022)"]
["Ecoinvent","Solar","PV","Unknown",85.09840921694835,"g/kWh","De-regionalized (Steubing et al 2022)"]
["Ecoinvent","Solar","PV","Unknown",70.87574564890728,"g/kWh","De-regionalized (Steubing et al 2022)"]
["Ecoinvent","Solar","PV","Unknown",83.96453872023802,"g/kWh","De-regionalized (Steubing et al 2022)"]
["Ecoinvent","Solar","PV","Unknown",85.09840921694835,"g/kWh","De-regionalized (Steubing et al 2022)"]
["Ecoinvent","Solar","PV","Unknown",80.86494495576859,"g/kWh","De-regionalized (Steubing et al 2022)"]
["Ecoinvent","Solar","PV","Unknown",94.26207726836788,"g/kWh","De-regionalized (Steubing et al 2022)"]
["Ecoinvent","Solar","PV","Unknown",65.38150342466693,"g/kWh","De-regionalized (Steubing et al 2022)"]
["Ecoinvent","Solar","PV","Unknown",77.45566167420631,"g/kWh","De-regionalized (Steubing et al 2022)"]
["Ecoinvent","Solar","PV","Unknown",80.86494495576859,"g/kWh","De-regionalized (Steubing et al 2022)"]
["Ecoinvent","Solar","PV","Unknown",95.79846729907702,"g/kWh","De-regionalized (Steubing et al 2022)"]
["Ecoinvent","Solar","PV","Unknown",85.09840921694835,"g/kWh","De-regionalized (Steubing et al 2022)"]
["Ecoinvent","Solar","PV","Unknown",65.38150342466693,"g/kWh","De-regionalized (Steubing et al 2022)"]
["Ecoinvent","Solar","PV","Unknown",77.45566167420631,"g/kWh","De-regionalized (Steubing et al 2022)"]
["Ecoinvent","Solar","PV","Unknown",85.09840921694835,"g/kWh","De-regionalized (Steubing et al 2022)"]
["Ecoinvent","Solar","PV","Unknown",50.20365396182072,"g/kWh","De-regionalized (Steubing et al 2022)"]
["Ecoinvent","Solar","PV","Unknown",59.47488253383385,"g/kWh","De-regionalized (Steubing et al 2022)"]
["Ecoinvent","Solar","PV","Unknown",85.09840921694835,"g/kWh","De-regionalized (Steubing et al 2022)"]
["Ecoinvent","Solar","PV","Unknown",68.01785785220427,"g/kWh","De-regionalized (Steubing et al 2022)"]
["Ecoinvent","Solar","PV","Unknown",80.57887796439582,"g/kWh","De-regionalized (Steubing et al 2022)"]
["Ecoinvent","Solar","PV","Unknown",85.09840921694835,"g/kWh","De-regionalized (Steubing et al 2022)"]
["Ecoinvent","Solar","PV","Unknown",84.76596853050734,"g/kWh","De-regionalized (Steubing et al 2022)"]
["Ecoinvent","Solar","PV","Unknown",100.4199022054441,"g/kWh","De-regionalized (Steubing et al 2022)"]
["Ecoinvent","Solar","PV","Unknown",54.767623081217366,"g/kWh","De-regionalized (Steubing et al 2022)"]
["Ecoinvent","Solar","PV","Unknown",64.88169072085786,"g/kWh","De-regionalized (Steubing et al 2022)"]
["Ecoinvent","Solar","PV","Unknown",107.5768298494274,"g/kWh","De-regionalized (Steubing et al 2022)"]
["Ecoinvent","Solar","PV","Unknown",127.44382465245971,"g/kWh","De-regionalized (Steubing et al 2022)"]
["Ecoinvent","Solar","PV","Unknown",80.86312110558954,"g/kWh","De-regionalized (Steubing et al 2022)"]
["Ecoinvent","Solar","PV","Unknown",121.8487343157495,"g/kWh","De-regionalized (Steubing et al 2022)"]
["Ecoinvent","Solar","PV","Unknown",80.86312110558954,"g/kWh","De-regionalized (Steubing et al 2022)"]
["Ecoinvent","Solar","PV","Unknown",125.3650746756584,"g/kWh","De-regionalized (Steubing et al 2022)"]
["Ecoinvent","Solar","PV","Unknown",83.25788733158565,"g/kWh","De-regionalized (Steubing et al 2022)"]
["Ecoinvent","Solar","PV","Unknown",98.63372632259123,"g/kWh","De-regionalized (Steubing et al 2022)"]
["Ecoinvent","Solar","PV","Unknown",87.78660139404813,"g/kWh","De-regionalized (Steubing et al 2022)"]
["Ecoinvent","Solar","PV","Unknown",100.8854522820056,"g/kWh","De-regionalized (Steubing et al 2022)"]
["Ecoinvent","Solar","PV","Unknown",119.51670177090371,"g/kWh","De-regionalized (Steubing et al 2022)"]
["Ecoinvent","Solar","PV","Unknown",106.3729945748473,"g/kWh","De-regionalized (Steubing et al 2022)"]
["Ecoinvent","Solar","PV","Unknown",69.4158350774824,"g/kWh","De-regionalized (Steubing et al 2022)"]
["Ecoinvent","Solar","PV","Unknown",82.2353617046581,"g/kWh","De-regionalized (Steubing et al 2022)"]
["Ecoinvent","Solar","PV","Unknown",80.86312110558954,"g/kWh","De-regionalized (Steubing et al 2022)"]
["Ecoinvent","Solar","PV","Unknown",105.5078778278801,"g/kWh","De-regionalized (Steubing et al 2022)"]
["Ecoinvent","Solar","PV","Unknown",61.56360805704244,"g/kWh","De-regionalized (Steubing et al 2022)"]
["Ecoinvent","Solar","PV","Unknown",28.59055516445077,"g/kWh","De-regionalized (Steubing et al 2022)"]
["Ecoinvent","Solar","PV","Unknown",62.475661933113656,"g/kWh","De-regionalized (Steubing et al 2022)"]
["Ecoinvent","Solar","PV","Unknown",64.38331073904347,"g/kWh","De-regionalized (Steubing et al 2022)"]
["Ecoinvent","Solar","PV","Unknown",59.3958723823378,"g/kWh","De-regionalized (Steubing et al 2022)"]
["Ecoinvent","Solar","PV","Unknown",63.41514151220733,"g/kWh","De-regionalized (Steubing et al 2022)"]
["Ecoinvent","Solar","PV","Unknown",63.89556131984062,"g/kWh","De-regionalized (Steubing et al 2022)"]
["Ecoinvent","Solar","PV","Unknown",58.166993840915644,"g/kWh","De-regionalized (Steubing et al 2022)"]
["Ecoinvent","Solar","PV","Unknown",61.11749260821565,"g/kWh","De-regionalized (Steubing et al 2022)"]
["Ecoinvent","Solar","PV","Unknown",59.81712177620604,"g/kWh","De-regionalized (Steubing et al 2022)"]
["Ecoinvent","Solar","PV","Unknown",61.56360805704244,"g/kWh","De-regionalized (Steubing et al 2022)"]
["Ecoinvent","Solar","PV","Unknown",63.89556131984062,"g/kWh","De-regionalized (Steubing et al 2022)"]
["Ecoinvent","Solar","PV","Unknown",65.38150342466693,"g/kWh","De-regionalized (Steubing et al 2022)"]
["Ecoinvent","Solar","PV","Unknown",58.57092909297208,"g/kWh","De-regionalized (Steubing et al 2022)"]
["Ecoinvent","Solar","PV","Unknown",59.81712177620604,"g/kWh","De-regionalized (Steubing et al 2022)"]
["Ecoinvent","Solar","PV","Unknown",58.57092909297208,"g/kWh","De-regionalized (Steubing et al 2022)"]
["Ecoinvent","Solar","PV","Unknown",64.38331073904347,"g/kWh","De-regionalized (Steubing et al 2022)"]
["Ecoinvent","Solar","PV","Unknown",66.93820739929942,"g/kWh","De-regionalized (Steubing et al 2022)"]
["Ecoinvent","Solar","PV","Unknown",64.87856761089066,"g/kWh","De-regionalized (Steubing et al 2022)"]
["Ecoinvent","Solar","PV","Unknown",80.94255372383951,"g/kWh","De-regionalized (Steubing et al 2022)"]
["Ecoinvent","Solar","PV","Unknown",95.8904082636655,"g/kWh","De-regionalized (Steubing et al 2022)"]
["Ecoinvent","Solar","PV","Unknown",75.10261491675774,"g/kWh","De-regionalized (Steubing et al 2022)"]
["Ecoinvent","Solar","PV","Unknown",88.97236049619407,"g/kWh","De-regionalized (Steubing et al 2022)"]
["Ecoinvent","Solar","PV","Unknown",79.18773457245359,"g/kWh","De-regionalized (Steubing et al 2022)"]
["Ecoinvent","Solar","PV","Unknown",86.50475681409276,"g/kWh","De-regionalized (Steubing et al 2022)"]
["Ecoinvent","Solar","PV","Unknown",102.4797966707512,"g/kWh","De-regionalized (Steubing et al 2022)"]
["Ecoinvent","Solar","PV","Unknown",91.20803074611871,"g/kWh","De-regionalized (Steubing et al 2022)"]
["Ecoinvent","Solar","PV","Unknown",80.86312110558954,"g/kWh","De-regionalized (Steubing et al 2022)"]
["Ecoinvent","Solar","PV","Unknown",120.81736516939431,"g/kWh","De-regionalized (Steubing et al 2022)"]
["Ecoinvent","Solar","PV","Unknown",80.86312110558954,"g/kWh","De-regionalized (Steubing et al 2022)"]
["Ecoinvent","Solar","PV","Unknown",62.44747483202334,"g/kWh","De-regionalized (Steubing et al 2022)"]
["Ecoinvent","Solar","PV","Unknown",48.195508819611376,"g/kWh","De-regionalized (Steubing et al 2022)"]
["Ecoinvent","Solar","PV","Unknown",57.09588843626593,"g/kWh","De-regionalized (Steubing et al 2022)"]
["Ecoinvent","Solar","PV","Unknown",85.09840921694835,"g/kWh","De-regionalized (Steubing et al 2022)"]
["Ecoinvent","Solar","PV","Unknown",98.99089215319577,"g/kWh","De-regionalized (Steubing et al 2022)"]
["Ecoinvent","Solar","PV","Unknown",117.2722594579224,"g/kWh","De-regionalized (Steubing et al 2022)"]
["Ecoinvent","Solar","PV","Unknown",104.375384926894,"g/kWh","De-regionalized (Steubing et al 2022)"]
["Ecoinvent","Solar","PV","Unknown",63.79745916524428,"g/kWh","De-regionalized (Steubing et al 2022)"]
["Ecoinvent","Solar","PV","Unknown",75.57939949050619,"g/kWh","De-regionalized (Steubing et al 2022)"]
["Ecoinvent","Solar","PV","Unknown",67.26764476335961,"g/kWh","De-regionalized (Steubing et al 2022)"]
["Ecoinvent","Solar","PV","Unknown",80.17132685054392,"g/kWh","De-regionalized (Steubing et al 2022)"]
["Ecoinvent","Solar","PV","Unknown",94.97714829079335,"g/kWh","De-regionalized (Steubing et al 2022)"]
["Ecoinvent","Solar","PV","Unknown",82.60552219245886,"g/kWh","De-regionalized (Steubing et al 2022)"]
["Ecoinvent","Solar","PV","Unknown",97.860884173141,"g/kWh","De-regionalized (Steubing et al 2022)"]
["Ecoinvent","Solar","PV","Unknown",75.7773939333375,"g/kWh","De-regionalized (Steubing et al 2022)"]
["Ecoinvent","Solar","PV","Unknown",89.7717558563571,"g/kWh","De-regionalized (Steubing et al 2022)"]
["Ecoinvent","Solar","PV","Unknown",99.10944592768861,"g/kWh","De-regionalized (Steubing et al 2022)"]
["Ecoinvent","Solar","PV","Unknown",117.4122238000338,"g/kWh","De-regionalized (Steubing et al 2022)"]
["Ecoinvent","Solar","PV","Unknown",87.76497357147963,"g/kWh","De-regionalized (Steubing et al 2022)"]
["Ecoinvent","Solar","PV","Unknown",103.9727406638491,"g/kWh","De-regionalized (Steubing et al 2022)"]
["Ecoinvent","Solar","PV","Unknown",92.53676860526271,"g/kWh","De-regionalized (Steubing et al 2022)"]
["Ecoinvent","Solar","PV","Unknown",65.58338598220163,"g/kWh","De-regionalized (Steubing et al 2022)"]
["Ecoinvent","Solar","PV","Unknown",77.69514638926302,"g/kWh","De-regionalized (Steubing et al 2022)"]
["Ecoinvent","Solar","PV","Unknown",69.15071902595808,"g/kWh","De-regionalized (Steubing et al 2022)"]
["Ecoinvent","Solar","PV","Unknown",101.37047867790889,"g/kWh","De-regionalized (Steubing et al 2022)"]
["Ecoinvent","Solar","PV","Unknown",120.0913015158458,"g/kWh","De-regionalized (Steubing et al 2022)"]
["Ecoinvent","Solar","PV","Unknown",85.09839963610901,"g/kWh","De-regionalized (Steubing et al 2022)"]
["Ecoinvent","Solar","PV","Unknown",119.69880969458819,"g/kWh","De-regionalized (Steubing et al 2022)"]
["Ecoinvent","Solar","PV","Unknown",123.6048158076591,"g/kWh","De-regionalized (Steubing et al 2022)"]
["Ecoinvent","Solar","PV","Unknown",143.1363578357812,"g/kWh","De-regionalized (Steubing et al 2022)"]
["Ecoinvent","Solar","PV","Unknown",146.8091419543269,"g/kWh","De-regionalized (Steubing et al 2022)"]
["Ecoinvent","Solar","PV","Unknown",82.82131958383528,"g/kWh","De-regionalized (Steubing et al 2022)"]
["Ecoinvent","Solar","PV","Unknown",98.44342202860909,"g/kWh","De-regionalized (Steubing et al 2022)"]
["Ecoinvent","Solar","PV","Unknown",65.8877779629522,"g/kWh","De-regionalized (Steubing et al 2022)"]
["Ecoinvent","Solar","PV","Unknown",88.02701578229515,"g/kWh","De-regionalized (Steubing et al 2022)"]
["Ecoinvent","Solar","PV","Unknown",49.94314652815039,"g/kWh","De-regionalized (Steubing et al 2022)"]
["Ecoinvent","Solar","PV","Unknown",75.67271171844526,"g/kWh","De-regionalized (Steubing et al 2022)"]
["Ecoinvent","Solar","PV","Unknown",76.21378335106462,"g/kWh","De-regionalized (Steubing et al 2022)"]
["Ecoinvent","Solar","PV","Unknown",80.86224383129256,"g/kWh","De-regionalized (Steubing et al 2022)"]
["Ecoinvent","Solar","PV","Unknown",71.77441349554981,"g/kWh","De-regionalized (Steubing et al 2022)"]
["Ecoinvent","Solar","PV","Unknown",80.48657546098731,"g/kWh","De-regionalized (Steubing et al 2022)"]
["Ecoinvent","Solar","PV","Unknown",92.22961241400209,"g/kWh","De-regionalized (Steubing et al 2022)"]
["Ecoinvent","Solar","PV","Unknown",112.0124136699155,"g/kWh","De-regionalized (Steubing et al 2022)"]
["Ecoinvent","Solar","PV","Unknown",80.86312110558954,"g/kWh","De-regionalized (Steubing et al 2022)"]
["Ecoinvent","Solar","PV","Unknown",134.4764000319321,"g/kWh","De-regionalized (Steubing et al 2022)"]
["Ecoinvent","Solar","PV","Unknown",85.09839963610901,"g/kWh","De-regionalized (Steubing et al 2022)"]
["Ecoinvent","Solar","PV","Unknown",70.16817140999511,"g/kWh","De-regionalized (Steubing et al 2022)"]
["Ecoinvent","Solar","PV","Unknown",83.12629505778251,"g/kWh","De-regionalized (Steubing et al 2022)"]
["Ecoinvent","Solar","PV","Unknown",73.98322198869548,"g/kWh","De-regionalized (Steubing et al 2022)"]
["Ecoinvent","Solar","PV","Unknown",70.16817140999511,"g/kWh","De-regionalized (Steubing et al 2022)"]
["Ecoinvent","Solar","PV","Unknown",83.12629505778251,"g/kWh","De-regionalized (Steubing et al 2022)"]
["Ecoinvent","Solar","PV","Unknown",73.98322198869548,"g/kWh","De-regionalized (Steubing et al 2022)"]
["Ecoinvent","Solar","PV","Unknown",70.57919491700692,"g/kWh","De-regionalized (Steubing et al 2022)"]
["Ecoinvent","Solar","PV","Unknown",83.61322325670353,"g/kWh","De-regionalized (Steubing et al 2022)"]
["Ecoinvent","Solar","PV","Unknown",74.41659661894563,"g/kWh","De-regionalized (Steubing et al 2022)"]
["Ecoinvent","Solar","PV","Unknown",70.57919491700692,"g/kWh","De-regionalized (Steubing et al 2022)"]
["Ecoinvent","Solar","PV","Unknown",83.61322325670353,"g/kWh","De-regionalized (Steubing et al 2022)"]
["Ecoinvent","Solar","PV","Unknown",74.41659661894563,"g/kWh","De-regionalized (Steubing et al 2022)"]
["Ecoinvent","Solar","PV","Unknown",70.57919491700692,"g/kWh","De-regionalized (Steubing et al 2022)"]
["Ecoinvent","Solar","PV","Unknown",83.61322325670353,"g/kWh","De-regionalized (Steubing et al 2022)"]
["Ecoinvent","Solar","PV","Unknown",74.41659661894563,"g/kWh","De-regionalized (Steubing et al 2022)"]
["Ecoinvent","Solar","PV","Unknown",70.16817140999511,"g/kWh","De-regionalized (Steubing et al 2022)"]
["Ecoinvent","Solar","PV","Unknown",83.12629505778251,"g/kWh","De-regionalized (Steubing et al 2022)"]
["Ecoinvent","Solar","PV","Unknown",58.693207839871285,"g/kWh","De-regionalized (Steubing et al 2022)"]
["Ecoinvent","Solar","PV","Unknown",69.53222258392077,"g/kWh","De-regionalized (Steubing et al 2022)"]
["Ecoinvent","Solar","PV","Unknown",61.884364361753335,"g/kWh","De-regionalized (Steubing et al 2022)"]
["Ecoinvent","Solar","PV","Unknown",76.18982806306421,"g/kWh","De-regionalized (Steubing et al 2022)"]
["Ecoinvent","Solar","PV","Unknown",90.25998541362763,"g/kWh","De-regionalized (Steubing et al 2022)"]
["Ecoinvent","Solar","PV","Unknown",80.86494495576859,"g/kWh","De-regionalized (Steubing et al 2022)"]
["Ecoinvent","Solar","PV","Unknown",65.38150342466693,"g/kWh","De-regionalized (Steubing et al 2022)"]
["Ecoinvent","Solar","PV","Unknown",77.45566167420631,"g/kWh","De-regionalized (Steubing et al 2022)"]
["Ecoinvent","Solar","PV","Unknown",80.86494495576859,"g/kWh","De-regionalized (Steubing et al 2022)"]
["Ecoinvent","Solar","PV","Unknown",95.79846729907702,"g/kWh","De-regionalized (Steubing et al 2022)"]
["Ecoinvent","Solar","PV","Unknown",68.0163237588817,"g/kWh","De-regionalized (Steubing et al 2022)"]
["Ecoinvent","Solar","PV","Unknown",80.5773924621879,"g/kWh","De-regionalized (Steubing et al 2022)"]
["Ecoinvent","Solar","PV","Unknown",74.63737929475258,"g/kWh","De-regionalized (Steubing et al 2022)"]
["Ecoinvent","Solar","PV","Unknown",88.4212064313783,"g/kWh","De-regionalized (Steubing et al 2022)"]
["Ecoinvent","Solar","PV","Unknown",83.17577721405823,"g/kWh","De-regionalized (Steubing et al 2022)"]
["Ecoinvent","Solar","PV","Unknown",98.53645233294587,"g/kWh","De-regionalized (Steubing et al 2022)"]
["Ecoinvent","Solar","PV","Unknown",68.57084335155449,"g/kWh","De-regionalized (Steubing et al 2022)"]
["Ecoinvent","Solar","PV","Unknown",81.23398461508235,"g/kWh","De-regionalized (Steubing et al 2022)"]
["Ecoinvent","Solar","PV","Unknown",51.74364400959722,"g/kWh","De-regionalized (Steubing et al 2022)"]
["Ecoinvent","Solar","PV","Unknown",61.29926621833136,"g/kWh","De-regionalized (Steubing et al 2022)"]
["Ecoinvent","Geothermal","GE","Unknown",81.70946741024444,"g/kWh","De-regionalized (Steubing et al 2022)"]
["Ecoinvent","Geothermal","GE","Unknown",81.70946741024444,"g/kWh","De-regionalized (Steubing et al 2022)"]
["Ecoinvent","Geothermal","GE","Unknown",81.70946741024444,"g/kWh","De-regionalized (Steubing et al 2022)"]
["Ecoinvent","Geothermal","GE","Unknown",81.70946741024444,"g/kWh","De-regionalized (Steubing et al 2022)"]
["Ecoinvent","Geothermal","GE","Unknown",81.70946741024444,"g/kWh","De-regionalized (Steubing et al 2022)"]
["Ecoinvent","Geothermal","GE","Unknown",81.70946741024444,"g/kWh","De-regionalized (Steubing et al 2022)"]
["Ecoinvent","Geothermal","GE","Unknown",81.70946741024444,"g/kWh","De-regionalized (Steubing et al 2022)"]
["Ecoinvent","Geothermal","GE","Unknown",81.70946741024444,"g/kWh","De-regionalized (Steubing et al 2022)"]
["Ecoinvent","Geothermal","GE","Unknown",81.70946741024444,"g/kWh","De-regionalized (Steubing et al 2022)"]
["Ecoinvent","Geothermal","GE","Unknown",81.70946741024444,"g/kWh","De-regionalized (Steubing et al 2022)"]
["Ecoinvent","Geothermal","GE","Unknown",81.70946741024444,"g/kWh","De-regionalized (Steubing et al 2022)"]
["Ecoinvent","Geothermal","GE","Unknown",81.70946741024444,"g/kWh","De-regionalized (Steubing et al 2022)"]
["Ecoinvent","Geothermal","GE","Unknown",81.70946741024444,"g/kWh","De-regionalized (Steubing et al 2022)"]
["Ecoinvent","Geothermal","GE","Unknown",81.70946741024444,"g/kWh","De-regionalized (Steubing et al 2022)"]
["Ecoinvent","Geothermal","GE","Unknown",81.70946741024444,"g/kWh","De-regionalized (Steubing et al 2022)"]
["Ecoinvent","Geothermal","GE","Unknown",81.70946741024444,"g/kWh","De-regionalized (Steubing et al 2022)"]
["Ecoinvent","Geothermal","GE","Unknown",81.70946741024444,"g/kWh","De-regionalized (Steubing et al 2022)"]
["Ecoinvent","Nec","NC","Unknown",1830.099826112263,"g/kWh","De-regionalized (Steubing et al 2022)"]
["Ecoinvent","Nec","NC","Unknown",1445.204481395371,"g/kWh","De-regionalized (Steubing et al 2022)"]
["Ecoinvent","Nec","NC","Unknown",1708.875073032108,"g/kWh","De-regionalized (Steubing et al 2022)"]
["Ecoinvent","Nec","NC","Unknown",1206.606223203448,"g/kWh","De-regionalized (Steubing et al 2022)"]
["Ecoinvent","Nec","NC","Unknown",1953.852554507998,"g/kWh","De-regionalized (Steubing et al 2022)"]
["Ecoinvent","Nec","NC","Unknown",1445.204481395371,"g/kWh","De-regionalized (Steubing et al 2022)"]
["Ecoinvent","Nec","NC","Unknown",2347.5325385904,"g/kWh","De-regionalized (Steubing et al 2022)"]
["Ecoinvent","Nec","NC","Unknown",1445.204481395371,"g/kWh","De-regionalized (Steubing et al 2022)"]
["Ecoinvent","Nec","NC","Unknown",1776.102558265186,"g/kWh","De-regionalized (Steubing et al 2022)"]
["Ecoinvent","Nec","NC","Unknown",1054.009847464801,"g/kWh","De-regionalized (Steubing et al 2022)"]
["Ecoinvent","Nec","NC","Unknown",2211.0101698193653,"g/kWh","De-regionalized (Steubing et al 2022)"]
["Ecoinvent","Nec","NC","Unknown",1754.532666217672,"g/kWh","De-regionalized (Steubing et al 2022)"]
["Ecoinvent","Nec","NC","Unknown",1054.009847464801,"g/kWh","De-regionalized (Steubing et al 2022)"]
["Ecoinvent","Nuclear","NU","Unknown",11.024158572437809,"g/kWh","De-regionalized (Steubing et al 2022)"]
["Ecoinvent","Nuclear","NU","Unknown",11.051180119451908,"g/kWh","De-regionalized (Steubing et al 2022)"]
["Ecoinvent","Nuclear","NU","Unknown",11.024158572437809,"g/kWh","De-regionalized (Steubing et al 2022)"]
["Ecoinvent","Nuclear","NU","Unknown",17.04678621885132,"g/kWh","De-regionalized (Steubing et al 2022)"]
["Ecoinvent","Nuclear","NU","Unknown",12.61272397662295,"g/kWh","De-regionalized (Steubing et al 2022)"]
["Ecoinvent","Nuclear","NU","Unknown",12.46720386036664,"g/kWh","De-regionalized (Steubing et al 2022)"]
["Ecoinvent","Nuclear","NU","Unknown",11.051180119451908,"g/kWh","De-regionalized (Steubing et al 2022)"]
["Ecoinvent","Nuclear","NU","Unknown",11.051180119451908,"g/kWh","De-regionalized (Steubing et al 2022)"]
["Ecoinvent","Nuclear","NU","Unknown",11.051300122544841,"g/kWh","De-regionalized (Steubing et al 2022)"]
["Ecoinvent","Nuclear","NU","Unknown",11.051300122544841,"g/kWh","De-regionalized (Steubing et al 2022)"]
["Ecoinvent","Nuclear","NU","Unknown",14.59957570780591,"g/kWh","De-regionalized (Steubing et al 2022)"]
["Ecoinvent","Nuclear","NU","Unknown",11.024158572437809,"g/kWh","De-regionalized (Steubing et al 2022)"]
["Ecoinvent","Nuclear","NU","Unknown",11.73265008125869,"g/kWh","De-regionalized (Steubing et al 2022)"]
["Ecoinvent","Nuclear","NU","Unknown",11.024158572437809,"g/kWh","De-regionalized (Steubing et al 2022)"]
["Ecoinvent","Nuclear","NU","Unknown",11.9150867786123,"g/kWh","De-regionalized (Steubing et al 2022)"]
["Ecoinvent","Nuclear","NU","Unknown",11.37904608349188,"g/kWh","De-regionalized (Steubing et al 2022)"]
["Ecoinvent","Nuclear","NU","Unknown",10.102476987655919,"g/kWh","De-regionalized (Steubing et al 2022)"]
["Ecoinvent","Nuclear","NU","Unknown",11.024158572437809,"g/kWh","De-regionalized (Steubing et al 2022)"]
["Ecoinvent","Nuclear","NU","Unknown",18.722149557354637,"g/kWh","De-regionalized (Steubing et al 2022)"]
["Ecoinvent","Nuclear","NU","Unknown",16.41152614893859,"g/kWh","De-regionalized (Steubing et al 2022)"]
["Ecoinvent","Nuclear","NU","Unknown",12.0414075835138,"g/kWh","De-regionalized (Steubing et al 2022)"]
["Ecoinvent","Nuclear","NU","Unknown",15.02950987452905,"g/kWh","De-regionalized (Steubing et al 2022)"]
["Ecoinvent","Nuclear","NU","Unknown",14.84456643506027,"g/kWh","De-regionalized (Steubing et al 2022)"]
["Ecoinvent","Nuclear","NU","Unknown",11.051300122544841,"g/kWh","De-regionalized (Steubing et al 2022)"]
["Ecoinvent","Nuclear","NU","Unknown",20.41869768479688,"g/kWh","De-regionalized (Steubing et al 2022)"]
["Ecoinvent","Nuclear","NU","Unknown",21.02925222246163,"g/kWh","De-regionalized (Steubing et al 2022)"]
["Ecoinvent","Nuclear","NU","Unknown",11.75730681686189,"g/kWh","De-regionalized (Steubing et al 2022)"]
["Ecoinvent","Nuclear","NU","Unknown",11.051300122544841,"g/kWh","De-regionalized (Steubing et al 2022)"]
["Ecoinvent","Nuclear","NU","Unknown",256.9859470538623,"g/kWh","De-regionalized (Steubing et al 2022)"]
["Ecoinvent","Nuclear","NU","Unknown",11.250417584257569,"g/kWh","De-regionalized (Steubing et al 2022)"]
["Ecoinvent","Nuclear","NU","Unknown",11.024158572437809,"g/kWh","De-regionalized (Steubing et al 2022)"]
["Ecoinvent","Nuclear","NU","Unknown",11.024285851092388,"g/kWh","De-regionalized (Steubing et al 2022)"]
["Ecoinvent","Nuclear","NU","Unknown",14.16256580978931,"g/kWh","De-regionalized (Steubing et al 2022)"]
["Ecoinvent","Nuclear","NU","Unknown",12.353790955718589,"g/kWh","De-regionalized (Steubing et al 2022)"]
["Ecoinvent","Nuclear","NU","Unknown",11.61194187430797,"g/kWh","De-regionalized (Steubing et al 2022)"]
["Ecoinvent","Nuclear","NU","Unknown",17.35503688637949,"g/kWh","De-regionalized (Steubing et al 2022)"]
["Ecoinvent","Nuclear","NU","Unknown",11.024158572437809,"g/kWh","De-regionalized (Steubing et al 2022)"]
["Ecoinvent","Nuclear","NU","Unknown",11.024158572437809,"g/kWh","De-regionalized (Steubing et al 2022)"]
["Ecoinvent","Nuclear","NU","Unknown",11.051300122544841,"g/kWh","De-regionalized (Steubing et al 2022)"]
["Ecoinvent","Nuclear","NU","Unknown",10.41428753230514,"g/kWh","De-regionalized (Steubing et al 2022)"]
["Ecoinvent","Nuclear","NU","Unknown",13.4247097756624,"g/kWh","De-regionalized (Steubing et al 2022)"]
["Ecoinvent","Nuclear","NU","Unknown",11.73265008125869,"g/kWh","De-regionalized (Steubing et al 2022)"]
["Ecoinvent","Nuclear","NU","Unknown",11.024158572437809,"g/kWh","De-regionalized (Steubing et al 2022)"]
["Ecoinvent","Nuclear","NU","Unknown",11.73265008125869,"g/kWh","De-regionalized (Steubing et al 2022)"]
["Ecoinvent","Nuclear","NU","Unknown",11.024158572437809,"g/kWh","De-regionalized (Steubing et al 2022)"]
["Ecoinvent","Nuclear","NU","Unknown",11.727869718504161,"g/kWh","De-regionalized (Steubing et al 2022)"]
["Ecoinvent","Nuclear","NU","Unknown",11.02104249791131,"g/kWh","De-regionalized (Steubing et al 2022)"]
["Ecoinvent","Nuclear","NU","Unknown",11.73265008125869,"g/kWh","De-regionalized (Steubing et al 2022)"]
["Ecoinvent","Nuclear","NU","Unknown",11.024158572437809,"g/kWh","De-regionalized (Steubing et al 2022)"]
["Ecoinvent","Nuclear","NU","Unknown",11.75711114908126,"g/kWh","De-regionalized (Steubing et al 2022)"]
["Ecoinvent","Nuclear","NU","Unknown",11.0511567966653,"g/kWh","De-regionalized (Steubing et al 2022)"]
["Ecoinvent","Nuclear","NU","Unknown",11.75711114908126,"g/kWh","De-regionalized (Steubing et al 2022)"]
["Ecoinvent","Nuclear","NU","Unknown",11.0511567966653,"g/kWh","De-regionalized (Steubing et al 2022)"]
["Ecoinvent","Nuclear","NU","Unknown",11.75711114908126,"g/kWh","De-regionalized (Steubing et al 2022)"]
["Ecoinvent","Nuclear","NU","Unknown",11.0511567966653,"g/kWh","De-regionalized (Steubing et al 2022)"]
["Ecoinvent","Nuclear","NU","Unknown",11.75711114908126,"g/kWh","De-regionalized (Steubing et al 2022)"]
["Ecoinvent","Nuclear","NU","Unknown",11.0511567966653,"g/kWh","De-regionalized (Steubing et al 2022)"]
["Ecoinvent","Nuclear","NU","Unknown",11.75711114908126,"g/kWh","De-regionalized (Steubing et al 2022)"]
["Ecoinvent","Nuclear","NU","Unknown",11.0511567966653,"g/kWh","De-regionalized (Steubing et al 2022)"]
["Ecoinvent","Nuclear","NU","Unknown",11.75711114908126,"g/kWh","De-regionalized (Steubing et al 2022)"]
["Ecoinvent","Nuclear","NU","Unknown",11.0511567966653,"g/kWh","De-regionalized (Steubing et al 2022)"]
["Ecoinvent","Nuclear","NU","Unknown",11.75711114908126,"g/kWh","De-regionalized (Steubing et al 2022)"]
["Ecoinvent","Nuclear","NU","Unknown",11.0511567966653,"g/kWh","De-regionalized (Steubing et al 2022)"]
["Ecoinvent","Nuclear","NU","Unknown",11.75711114908126,"g/kWh","De-regionalized (Steubing et al 2022)"]
["Ecoinvent","Nuclear","NU","Unknown",11.0511567966653,"g/kWh","De-regionalized (Steubing et al 2022)"]
["Ecoinvent","Nuclear","NU","Unknown",11.50569676354356,"g/kWh","De-regionalized (Steubing et al 2022)"]
["Ecoinvent","Nuclear","NU","Unknown",11.051300122544841,"g/kWh","De-regionalized (Steubing et al 2022)"]

{"sheet":"Stat analysis LCCI by tech","index":4,"n_rows":44,"n_cols":12,"rows_kept":44}
["Technology","Source","n","Lower whisker\n(g/kWh)","Q1\n(g/kWh)","Median\n(g/kWh)","Q3\n(g/kWh)","Upper whisker\n(g/kWh)","IQR\n(g/kWh)","Mean\n(g/kWh)","Std Dev\n(g/kWh)","CV%"]
["Biomass and waste","EXIO Hybrid",23,{"v":22.55168624900715,"d":"22.6"},{"v":35.51568537214875,"d":"35.5"},{"v":51.28202025620563,"d":"51.3"},{"v":154.2141748853379,"d":"154.2"},{"v":306.9448128285441,"d":"306.9"},{"v":118.6984895131892,"d":"118.7"},{"v":110.0445812892324,"d":"110.0"},{"v":109.8936279686611,"d":"109.9"},{"$f":"K2/J2","v":{"v":0.998628253033427,"d":"100%"}}]
["Biomass and waste","Ecoinvent",169,{"v":0,"d":"0.0"},{"v":45.63551203655669,"d":"45.6"},{"v":49.04978252515544,"d":"49.0"},{"v":171.8730524484979,"d":"171.9"},{"v":323.0819066840028,"d":"323.1"},{"v":126.2375404119412,"d":"126.2"},{"v":95.1965110958287,"d":"95.2"},{"v":101.9353392738399,"d":"101.9"},{"v":1.0707886045448411,"d":"107%"}]
["Biomass and waste","Electricity Maps",28,{"v":230,"d":"230.0"},{"v":230,"d":"230.0"},{"v":230,"d":"230.0"},{"v":230,"d":"230.0"},{"v":230,"d":"230.0"},{"v":0,"d":"0.0"},{"v":231.9943308607143,"d":"232.0"},{"v":10.55300697886279,"d":"10.6"},{"v":0.04548821059424356,"d":"5%"}]
["Biomass and waste","IPCC",3,{"v":130,"d":"130.0"},{"v":180,"d":"180.0"},{"v":230,"d":"230.0"},{"v":560,"d":"560.0"},{"v":890,"d":"890.0"},{"v":380,"d":"380.0"},{"v":416.6666666666667,"d":"416.7"},{"v":412.9568177586288,"d":"413.0"},{"v":0.9910963626207091,"d":"99%"}]
["Coal","EXIO Hybrid",23,{"v":1174.35590033162,"d":"1174.4"},{"v":1346.164760182009,"d":"1346.2"},{"v":1651.71689875664,"d":"1651.7"},{"v":1752.987390330794,"d":"1753.0"},{"v":2103.588007285959,"d":"2103.6"},{"v":406.8226301487853,"d":"406.8"},{"v":1602.61071693055,"d":"1602.6"},{"v":256.6748152872374,"d":"256.7"},{"v":0.1601604260945177,"d":"16%"}]
["Coal","Ecoinvent",161,{"v":926.3768193743277,"d":"926.4"},{"v":1166.942250859641,"d":"1166.9"},{"v":1269.031713341569,"d":"1269.0"},{"v":1496.991922007324,"d":"1497.0"},{"v":1926.106056632377,"d":"1926.1"},{"v":330.0496711476831,"d":"330.0"},{"v":1353.023207781061,"d":"1353.0"},{"v":256.6277586858675,"d":"256.6"},{"v":0.18966988682088712,"d":"19%"}]
["Coal","Electricity Maps",28,{"v":983.04,"d":"983.0"},{"v":1074.525,"d":"1074.5"},{"v":1097.31,"d":"1097.3"},{"v":1174.78290675,"d":"1174.8"},{"v":1291.95,"d":"1292.0"},{"v":100.2579067499998,"d":"100.3"},{"v":1094.249416821428,"d":"1094.2"},{"v":141.5826882692649,"d":"141.6"},{"v":0.1293879494864469,"d":"13%"}]
["Coal","IPCC",3,{"v":740,"d":"740.0"},{"v":780,"d":"780.0"},{"v":820,"d":"820.0"},{"v":865,"d":"865.0"},{"v":910,"d":"910.0"},{"v":85,"d":"85.0"},{"v":823.3333333333334,"d":"823.3"},{"v":85.04900548115383,"d":"85.0"},{"v":0.10329838722407347,"d":"10%"}]
["Coal","NREL",3,{"v":930,"d":"930.0"},{"v":955,"d":"955.0"},{"v":980,"d":"980.0"},{"v":1015,"d":"1015.0"},{"v":1050,"d":"1050.0"},{"v":60,"d":"60.0"},{"v":986.6666666666666,"d":"986.7"},{"v":60.27713773341708,"d":"60.3"},{"v":0.06109169364873353,"d":"6%"}]
["Geothermal","EXIO Hybrid",5,{"v":10.67805571107301,"d":"10.7"},{"v":13.56416787302156,"d":"13.6"},{"v":58.08240536082916,"d":"58.1"},{"v":85.46626832992928,"d":"85.5"},{"v":94.794761516486,"d":"94.8"},{"v":71.90210045690772,"d":"71.9"},{"v":52.51713175826781,"d":"52.5"},{"v":39.28058530938213,"d":"39.3"},{"v":0.7479575520267853,"d":"75%"}]
["Geothermal","Ecoinvent",17,{"v":81.70946741024444,"d":"81.7"},{"v":81.70946741024444,"d":"81.7"},{"v":81.70946741024444,"d":"81.7"},{"v":81.70946741024444,"d":"81.7"},{"v":81.70946741024444,"d":"81.7"},{"v":0,"d":"0.0"},{"v":81.70946741024444,"d":"81.7"},{"v":0,"d":"0.0"},{"v":0,"d":"0%"}]
["Geothermal","Electricity Maps",28,{"v":38,"d":"38.0"},{"v":38,"d":"38.0"},{"v":38,"d":"38.0"},{"v":38,"d":"38.0"},{"v":38,"d":"38.0"},{"v":0,"d":"0.0"},{"v":40.53142326107143,"d":"40.5"},{"v":13.39503282367827,"d":"13.4"},{"v":0.33048513340866525,"d":"33%"}]
["Geothermal","IPCC",3,{"v":6,"d":"6.0"},{"v":22,"d":"22.0"},{"v":38,"d":"38.0"},58.5,{"v":79,"d":"79.0"},36.5,{"v":41,"d":"41.0"},{"v":36.59234892706397,"d":"36.6"},{"v":0.8924963152942432,"d":"89%"}]
["Hydro","EXIO Hybrid",26,{"v":1.377716781368655,"d":"1.4"},{"v":12.68067689528033,"d":"12.7"},{"v":26.60575818636278,"d":"26.6"},{"v":54.83545716106777,"d":"54.8"},{"v":98.5003115995253,"d":"98.5"},{"v":42.15478026578744,"d":"42.2"},{"v":40.83680841318282,"d":"40.8"},{"v":42.91534526661426,"d":"42.9"},{"v":1.050898611674081,"d":"105%"}]
["Hydro","Ecoinvent",251,{"v":3.956887169816734,"d":"4.0"},{"v":4.404442450969873,"d":"4.4"},{"v":6.95426848330844,"d":"7.0"},{"v":88.12751405810343,"d":"88.1"},{"v":176.9774844323079,"d":"177.0"},{"v":83.72307160713356,"d":"83.7"},{"v":291.8584626346682,"d":"291.9"},{"v":568.350844782662,"d":"568.4"},{"v":1.9473509167835616,"d":"195%"}]
["Hydro","Electricity Maps",28,10.7,10.7,10.7,10.7,10.7,{"v":0,"d":"0.0"},{"v":11.175,"d":"11.2"},{"v":2.513463745511361,"d":"2.5"},{"v":0.22491845597417098,"d":"22%"}]
["Hydro","IPCC",3,{"v":1,"d":"1.0"},12.5,{"v":24,"d":"24.0"},{"v":1112,"d":"1112.0"},{"v":2200,"d":"2200.0"},1099.5,{"v":741.6666666666666,"d":"741.7"},{"v":1263.006070188633,"d":"1263.0"},{"v":1.7029295328386063,"d":"170%"}]
["Natural Gas","EXIO Hybrid",26,{"v":730.5080348021767,"d":"730.5"},{"v":852.0302421412775,"d":"852.0"},{"v":988.0891892375017,"d":"988.1"},{"v":1336.926136337382,"d":"1336.9"},{"v":2043.277424850575,"d":"2043.3"},{"v":484.8958941961046,"d":"484.9"},{"v":1318.110731292322,"d":"1318.1"},{"v":935.8430036095275,"d":"935.8"},{"v":0.7099881530377908,"d":"71%"}]
["Natural Gas","Ecoinvent",321,{"v":209.3190707104352,"d":"209.3"},{"v":498.5747186806974,"d":"498.6"},{"v":598.8311988520171,"d":"598.8"},{"v":707.2664863456597,"d":"707.3"},{"v":990.8489244806473,"d":"990.8"},{"v":208.6917676649623,"d":"208.7"},{"v":612.5662982137558,"d":"612.6"},{"v":157.642327834593,"d":"157.6"},{"v":0.25734737332804347,"d":"26%"}]
["Natural Gas","Electricity Maps",28,{"v":484.25,"d":"484.3"},{"v":508.8425,"d":"508.8"},{"v":529.2950000000001,"d":"529.3"},{"v":530.39,"d":"530.4"},{"v":561.99,"d":"562.0"},{"v":21.54749999999996,"d":"21.5"},{"v":529.0247962928571,"d":"529.0"},{"v":52.65898396252143,"d":"52.7"},{"v":0.09953972730868085,"d":"10%"}]
["Natural Gas","IPCC",3,{"v":410,"d":"410.0"},{"v":450,"d":"450.0"},{"v":490,"d":"490.0"},{"v":570,"d":"570.0"},{"v":650,"d":"650.0"},{"v":120,"d":"120.0"},{"v":516.6666666666666,"d":"516.7"},{"v":122.2020185321557,"d":"122.2"},{"v":0.23652003586868847,"d":"24%"}]
["Natural Gas","NREL",3,{"v":427,"d":"427.0"},456.5,{"v":486,"d":"486.0"},{"v":522,"d":"522.0"},{"v":558,"d":"558.0"},65.5,{"v":490.3333333333333,"d":"490.3"},{"v":65.60741827974435,"d":"65.6"},{"v":0.13380166882340794,"d":"13%"}]
["Nec","EXIO Hybrid",6,{"v":53.55145014715315,"d":"53.6"},{"v":89.8889911055797,"d":"89.9"},{"v":218.6281859869468,"d":"218.6"},{"v":296.0821346049169,"d":"296.1"},{"v":352.6882213475761,"d":"352.7"},{"v":206.1931434993372,"d":"206.2"},{"v":202.0620145152201,"d":"202.1"},{"v":128.7156918552174,"d":"128.7"},{"v":0.6370108313728705,"d":"64%"}]
["Nuclear","EXIO Hybrid",14,{"v":3.735328362583353,"d":"3.7"},{"v":12.27063011222637,"d":"12.3"},{"v":23.27919744694544,"d":"23.3"},{"v":44.466609095409,"d":"44.5"},{"v":84.58202286491004,"d":"84.6"},{"v":32.19597898318263,"d":"32.2"},{"v":29.79668206656847,"d":"29.8"},{"v":22.55000469733456,"d":"22.6"},{"v":0.7567958287085731,"d":"76%"}]
["Nuclear","Ecoinvent",67,{"v":10.10247698765592,"d":"10.1"},{"v":11.0511567966653,"d":"11.1"},{"v":11.37904608349188,"d":"11.4"},{"v":11.8361967977371,"d":"11.8"},{"v":12.61272397662295,"d":"12.6"},{"v":0.7850400010717955,"d":"0.8"},{"v":15.8707274256971,"d":"15.9"},{"v":29.98812402280343,"d":"30.0"},{"v":1.8895242302661022,"d":"189%"}]
["Nuclear","Electricity Maps",28,{"v":5.13,"d":"5.1"},{"v":5.13,"d":"5.1"},{"v":5.13,"d":"5.1"},{"v":5.13,"d":"5.1"},{"v":5.13,"d":"5.1"},{"v":0,"d":"0.0"},{"v":5.375357142857142,"d":"5.4"},{"v":1.298307964786696,"d":"1.3"},{"v":0.24152961938759876,"d":"24%"}]
["Nuclear","IPCC",3,3.7,{"v":7.85,"d":"7.9"},{"v":12,"d":"12.0"},{"v":61,"d":"61.0"},{"v":110,"d":"110.0"},{"v":53.15,"d":"53.2"},41.9,{"v":59.12216166548716,"d":"59.1"},{"v":1.4110301113481423,"d":"141%"}]
["Nuclear","NREL",3,{"v":10,"d":"10.0"},11.5,{"v":13,"d":"13.0"},{"v":26,"d":"26.0"},{"v":39,"d":"39.0"},14.5,{"v":20.66666666666667,"d":"20.7"},{"v":15.94783161854092,"d":"15.9"},{"v":0.7716692718648831,"d":"77%"}]
["Oil","EXIO Hybrid",28,{"v":1209.841902320524,"d":"1209.8"},{"v":1604.441269543589,"d":"1604.4"},{"v":1775.237783087024,"d":"1775.2"},{"v":1896.930939042444,"d":"1896.9"},{"v":1943.351537124611,"d":"1943.4"},{"v":292.4896694988545,"d":"292.5"},{"v":1841.105942637723,"d":"1841.1"},{"v":391.2788811425021,"d":"391.3"},{"v":0.2125238271633207,"d":"21%"}]
["Oil","Ecoinvent",155,{"v":446.809471782271,"d":"446.8"},{"v":875.0377542670747,"d":"875.0"},{"v":1058.211662135353,"d":"1058.2"},{"v":1165.801636700227,"d":"1165.8"},{"v":1540.665659974499,"d":"1540.7"},{"v":290.7638824331527,"d":"290.8"},{"v":1055.302046375735,"d":"1055.3"},{"v":328.1791564387759,"d":"328.2"},{"v":0.31098125656616926,"d":"31%"}]
["Oil","Electricity Maps",28,{"v":617.49,"d":"617.5"},{"v":885.08,"d":"885.1"},{"v":885.08,"d":"885.1"},{"v":1121.035,"d":"1121.0"},{"v":1169.95,"d":"1170.0"},{"v":235.955,"d":"236.0"},{"v":960.9710238892859,"d":"961.0"},{"v":143.1662718979646,"d":"143.2"},{"v":0.1489808416059576,"d":"15%"}]
["Solar","EXIO Hybrid",24,{"v":4.111600333371584,"d":"4.1"},{"v":25.4581688577459,"d":"25.5"},{"v":48.44792149896042,"d":"48.4"},{"v":73.80213730508686,"d":"73.8"},{"v":99.12023507358373,"d":"99.1"},{"v":48.34396844734096,"d":"48.3"},{"v":57.81925788016273,"d":"57.8"},{"v":56.48217944407426,"d":"56.5"},{"v":0.9768748599496084,"d":"98%"}]
["Solar","Ecoinvent",260,{"v":49.94314652815039,"d":"49.9"},{"v":74.41659661894563,"d":"74.4"},{"v":80.86494495576859,"d":"80.9"},{"v":90.83437001858607,"d":"90.8"},{"v":115.1105542114738,"d":"115.1"},{"v":16.41777339964044,"d":"16.4"},{"v":83.20232668083189,"d":"83.2"},{"v":16.45331158317421,"d":"16.5"},{"v":0.19775061875721217,"d":"20%"}]
["Solar","Electricity Maps",28,25.6,{"v":28.70833333,"d":"28.7"},{"v":33.666666665,"d":"33.7"},{"v":36.55,"d":"36.6"},{"v":45,"d":"45.0"},{"v":7.841666669999995,"d":"7.8"},{"v":33.54298245607144,"d":"33.5"},{"v":6.137017961521178,"d":"6.1"},{"v":0.18295981788615068,"d":"18%"}]
["Solar","IPCC",6,8.8,{"v":20.25,"d":"20.3"},37.5,{"v":59.25,"d":"59.3"},{"v":63,"d":"63.0"},{"v":39,"d":"39.0"},{"v":57.46666666666667,"d":"57.5"},{"v":63.22805284576354,"d":"63.2"},{"v":1.1002561400074862,"d":"110%"}]
["Solar","NREL",6,{"v":14,"d":"14.0"},{"v":29,"d":"29.0"},33.5,{"v":41,"d":"41.0"},{"v":50,"d":"50.0"},{"v":12,"d":"12.0"},{"v":33.66666666666666,"d":"33.7"},{"v":12.46862729680644,"d":"12.5"},{"v":0.37035526624177556,"d":"37%"}]
["Tide and wave","EXIO Hybrid",3,{"v":64.014,"d":"64.0"},{"v":94.11389948761044,"d":"94.1"},{"v":124.2137989752209,"d":"124.2"},{"v":277.2243994876105,"d":"277.2"},{"v":430.235,"d":"430.2"},{"v":183.1105,"d":"183.1"},{"v":206.1542663250736,"d":"206.2"},{"v":196.3800788073582,"d":"196.4"},{"v":0.9525879930017892,"d":"95%"}]
["Tide and wave","IPCC",3,5.6,11.3,{"v":17,"d":"17.0"},22.5,{"v":28,"d":"28.0"},11.2,{"v":16.86666666666667,"d":"16.9"},{"v":11.20059522227874,"d":"11.2"},{"v":0.6640669104117828,"d":"66%"}]
["Wind","EXIO Hybrid",26,{"v":2.584664057316208,"d":"2.6"},{"v":13.03771351123651,"d":"13.0"},{"v":22.60170913437072,"d":"22.6"},{"v":41.69649037808811,"d":"41.7"},{"v":71.47089878161168,"d":"71.5"},{"v":28.6587768668516,"d":"28.7"},{"v":39.36029260091466,"d":"39.4"},{"v":45.74808557066428,"d":"45.7"},{"v":1.162290281592093,"d":"116%"}]
["Wind","Ecoinvent",303,{"v":10.95599806383884,"d":"11.0"},{"v":15.71074047155306,"d":"15.7"},{"v":20.6641138466623,"d":"20.7"},{"v":23.65670624804876,"d":"23.7"},{"v":34.62845000905088,"d":"34.6"},{"v":7.945965776495699,"d":"7.9"},{"v":22.1706773509683,"d":"22.2"},{"v":10.07216270317585,"d":"10.1"},{"v":0.45430108172748046,"d":"45%"}]
["Wind","Electricity Maps",28,{"v":12.62,"d":"12.6"},{"v":12.62,"d":"12.6"},{"v":12.62,"d":"12.6"},{"v":12.62,"d":"12.6"},{"v":12.62,"d":"12.6"},{"v":0,"d":"0.0"},{"v":12.56214285714286,"d":"12.6"},{"v":0.3061512231374739,"d":"0.3"},{"v":0.02437093946622297,"d":"2%"}]
["Wind","IPCC",3,{"v":7,"d":"7.0"},{"v":9,"d":"9.0"},{"v":11,"d":"11.0"},33.5,{"v":56,"d":"56.0"},24.5,{"v":24.66666666666667,"d":"24.7"},{"v":27.20906711619002,"d":"27.2"},{"v":1.1030702884941899,"d":"110%"}]
["Wind","NREL",3,{"v":8,"d":"8.0"},10.5,{"v":13,"d":"13.0"},16.5,{"v":20,"d":"20.0"},{"v":6,"d":"6.0"},{"v":13.66666666666667,"d":"13.7"},{"v":6.027713773341708,"d":"6.0"},{"v":0.4410522273176859,"d":"44%"}]

{"sheet":"DCI by country","index":5,"n_rows":324,"n_cols":8,"rows_kept":324}
["Country","Year","DB type","Source","GWP100","Unit","Notes","Data from figure 2 in manuscript"]
["BE",2017,"Physical","JRC",217.128376783737,"g/kWh"]
["BG",2017,"Physical","JRC",658.4280191584099,"g/kWh"]
["CZ",2017,"Physical","JRC",659.618779950752,"g/kWh"]
["DK",2017,"Physical","JRC",140.558131432961,"g/kWh"]
["DE",2017,"Physical","JRC",474.827287854926,"g/kWh"]
["EE",2017,"Physical","JRC",1032.46527781311,"g/kWh"]
["IE",2017,"Physical","JRC",422.844473630696,"g/kWh"]
["GR",2017,"Physical","JRC",615.218131264069,"g/kWh"]
["ES",2017,"Physical","JRC",338.12990881688097,"g/kWh"]
["FR",2017,"Physical","JRC",87.2296972628698,"g/kWh"]
["HR",2017,"Physical","JRC",418.883203724843,"g/kWh"]
["IT",2017,"Physical","JRC",327.670215918589,"g/kWh"]
["CY",2017,"Physical","JRC",722.279491964097,"g/kWh"]
["LV",2017,"Physical","JRC",370.21389755293,"g/kWh"]
["LT",2017,"Physical","JRC",70.6745925198884,"g/kWh"]
["LU",2017,"Physical","JRC",437.211310590705,"g/kWh"]
["HU",2017,"Physical","JRC",282.302921903931,"g/kWh"]
["MT",2017,"Physical","JRC",423.599179161041,"g/kWh"]
["NL",2017,"Physical","JRC",466.041708142696,"g/kWh"]
["AT",2017,"Physical","JRC",315.53103420081203,"g/kWh"]
["PL",2017,"Physical","JRC",867.557853085136,"g/kWh"]
["PT",2017,"Physical","JRC",423.487234442501,"g/kWh"]
["RO",2017,"Physical","JRC",471.221534694691,"g/kWh"]
["SI",2017,"Physical","JRC",235.521835040477,"g/kWh"]
["SK",2017,"Physical","JRC",429.075929910542,"g/kWh"]
["FI",2017,"Physical","JRC",98.4943316320439,"g/kWh"]
["SE",2017,"Physical","JRC",17.0470352100545,"g/kWh"]
["AT",2017,"Physical","Electricity Maps",90.4851354012873,"g/kWh","generation shares from ENTSO-E"]
["AT",2017,"Hybrid","EXIO Hybrid",154.308800429182,"g/kWh","generation shares from ENTSO-E"]
["BE",2017,"Physical","Electricity Maps",141.314889698449,"g/kWh","generation shares from ENTSO-E"]
["BE",2017,"Hybrid","EXIO Hybrid",185.213931629819,"g/kWh","generation shares from ENTSO-E"]
["BG",2017,"Physical","Electricity Maps",545.012194430927,"g/kWh","generation shares from ENTSO-E"]
["BG",2017,"Hybrid","EXIO Hybrid",542.045782200647,"g/kWh","generation shares from ENTSO-E"]
["CZ",2017,"Physical","Electricity Maps",553.200289906823,"g/kWh","generation shares from ENTSO-E"]
["CZ",2017,"Hybrid","EXIO Hybrid",558.408398547125,"g/kWh","generation shares from ENTSO-E"]
["DE",2017,"Physical","Electricity Maps",448.702731277532,"g/kWh","generation shares from ENTSO-E"]
["DE",2017,"Hybrid","EXIO Hybrid",454.99095254016,"g/kWh","generation shares from ENTSO-E"]
["DK",2017,"Physical","Electricity Maps",173.256950607895,"g/kWh","generation shares from ENTSO-E"]
["DK",2017,"Hybrid","EXIO Hybrid",229.581836290414,"g/kWh","generation shares from ENTSO-E"]
["EE",2017,"Physical","Electricity Maps",574.274610065271,"g/kWh","generation shares from ENTSO-E"]
["EE",2017,"Hybrid","EXIO Hybrid",544.219733492155,"g/kWh","generation shares from ENTSO-E"]
["GR",2017,"Physical","Electricity Maps",604.554543084119,"g/kWh","generation shares from ENTSO-E"]
["GR",2017,"Hybrid","EXIO Hybrid",599.792428776566,"g/kWh","generation shares from ENTSO-E"]
["ES",2017,"Physical","Electricity Maps",314.68529363203,"g/kWh","generation shares from ENTSO-E"]
["ES",2017,"Hybrid","EXIO Hybrid",299.238891463561,"g/kWh","generation shares from ENTSO-E"]
["FI",2017,"Physical","Electricity Maps",155.889545402563,"g/kWh","generation shares from ENTSO-E"]
["FI",2017,"Hybrid","EXIO Hybrid",246.012961154905,"g/kWh","generation shares from ENTSO-E"]
["FR",2017,"Physical","Electricity Maps",51.0338344531707,"g/kWh","generation shares from ENTSO-E"]
["FR",2017,"Hybrid","EXIO Hybrid",71.5099287847903,"g/kWh","generation shares from ENTSO-E"]
["HR",2017,"Physical","Electricity Maps",229.137155963302,"g/kWh","generation shares from ENTSO-E"]
["HR",2017,"Hybrid","EXIO Hybrid",270.18885480849,"g/kWh","generation shares from ENTSO-E"]
["HU",2017,"Physical","Electricity Maps",320.611529846787,"g/kWh","generation shares from ENTSO-E"]
["HU",2017,"Hybrid","EXIO Hybrid",317.412148063025,"g/kWh","generation shares from ENTSO-E"]
["IE",2017,"Physical","Electricity Maps",505.248267484473,"g/kWh","generation shares from ENTSO-E"]
["IE",2017,"Hybrid","EXIO Hybrid",453.891160323552,"g/kWh","generation shares from ENTSO-E"]
["IT",2017,"Physical","Electricity Maps",384.552422808706,"g/kWh","generation shares from ENTSO-E"]
["IT",2017,"Hybrid","EXIO Hybrid",345.19267276119,"g/kWh","generation shares from ENTSO-E"]
["LT",2017,"Physical","Electricity Maps",104.416771067549,"g/kWh","generation shares from ENTSO-E"]
["LT",2017,"Hybrid","EXIO Hybrid",120.289488206423,"g/kWh","generation shares from ENTSO-E"]
["LV",2017,"Physical","Electricity Maps",134.804726068377,"g/kWh","generation shares from ENTSO-E"]
["LV",2017,"Hybrid","EXIO Hybrid",144.456041456347,"g/kWh","generation shares from ENTSO-E"]
["NL",2017,"Physical","Electricity Maps",527.982015420876,"g/kWh","generation shares from ENTSO-E"]
["NL",2017,"Hybrid","EXIO Hybrid",395.234889340344,"g/kWh","generation shares from ENTSO-E"]
["PL",2017,"Physical","Electricity Maps",916.434430744539,"g/kWh","generation shares from ENTSO-E"]
["PL",2017,"Hybrid","EXIO Hybrid",760.243199010558,"g/kWh","generation shares from ENTSO-E"]
["PT",2017,"Physical","Electricity Maps",393.2200459742,"g/kWh","generation shares from ENTSO-E"]
["PT",2017,"Hybrid","EXIO Hybrid",398.855653628542,"g/kWh","generation shares from ENTSO-E"]
["RO",2017,"Physical","Electricity Maps",430.136005158907,"g/kWh","generation shares from ENTSO-E"]
["RO",2017,"Hybrid","EXIO Hybrid",400.543036350995,"g/kWh","generation shares from ENTSO-E"]
["SE",2017,"Physical","Electricity Maps",1.52382168863012,"g/kWh","generation shares from ENTSO-E"]
["SE",2017,"Hybrid","EXIO Hybrid",0.0181887536716836,"g/kWh","generation shares from ENTSO-E"]
["SI",2017,"Physical","Electricity Maps",305.807919735401,"g/kWh","generation shares from ENTSO-E"]
["SI",2017,"Hybrid","EXIO Hybrid",292.216376489959,"g/kWh","generation shares from ENTSO-E"]
["SK",2017,"Physical","Electricity Maps",169.084436423105,"g/kWh","generation shares from ENTSO-E"]
["SK",2017,"Hybrid","EXIO Hybrid",138.959741619006,"g/kWh","generation shares from ENTSO-E"]
["US",2017,"Physical","Electricity Maps",438.912221743761,"g/kWh","generation shares from ENTSO-E"]
["US",2017,"Hybrid","EXIO Hybrid",441.13513896592,"g/kWh","generation shares from ENTSO-E"]
["AT",2017,"Monetary","EORA",{"v":47.71237451457567,"d":"47.712"},"g/kWh"]
["BE",2017,"Monetary","EORA",{"v":159.50758863576687,"d":"159.508"},"g/kWh"]
["BG",2017,"Monetary","EORA",{"v":217.28836178593517,"d":"217.288"},"g/kWh"]
["CY",2017,"Monetary","EORA",{"v":454.29618935435474,"d":"454.296"},"g/kWh"]
["CZ",2017,"Monetary","EORA",{"v":165.32298435384064,"d":"165.323"},"g/kWh"]
["DE",2017,"Monetary","EORA",{"v":141.5611425620154,"d":"141.561"},"g/kWh"]
["DK",2017,"Monetary","EORA",{"v":163.33868963868818,"d":"163.339"},"g/kWh"]
["ES",2017,"Monetary","EORA",{"v":172.57657139029578,"d":"172.577"},"g/kWh"]
["EE",2017,"Monetary","EORA",{"v":351.57673005299233,"d":"351.577"},"g/kWh"]
["FI",2017,"Monetary","EORA",{"v":189.92170591010012,"d":"189.922"},"g/kWh"]
["FR",2017,"Monetary","EORA",{"v":39.95075417576995,"d":"39.951"},"g/kWh"]
["GR",2017,"Monetary","EORA",{"v":492.5601964069266,"d":"492.560"},"g/kWh"]
["HR",2017,"Monetary","EORA",{"v":120.42168826809501,"d":"120.422"},"g/kWh"]
["HU",2017,"Monetary","EORA",{"v":113.95592353969333,"d":"113.956"},"g/kWh"]
["IE",2017,"Monetary","EORA",{"v":277.48729152165055,"d":"277.487"},"g/kWh"]
["IT",2017,"Monetary","EORA",{"v":170.16972161857458,"d":"170.170"},"g/kWh"]
["LT",2017,"Monetary","EORA",{"v":93.48947766055223,"d":"93.489"},"g/kWh"]
["LU",2017,"Monetary","EORA",{"v":62.35397965710689,"d":"62.354"},"g/kWh"]
["LV",2017,"Monetary","EORA",{"v":113.06177711898054,"d":"113.062"},"g/kWh"]
["MT",2017,"Monetary","EORA",{"v":430.80593864581067,"d":"430.806"},"g/kWh"]
["NL",2017,"Monetary","EORA",{"v":131.93075445080697,"d":"131.931"},"g/kWh"]
["PL",2017,"Monetary","EORA",{"v":279.23220515191775,"d":"279.232"},"g/kWh"]
["PT",2017,"Monetary","EORA",{"v":159.87733667000467,"d":"159.877"},"g/kWh"]
["RO",2017,"Monetary","EORA",{"v":120.63676208552405,"d":"120.637"},"g/kWh"]
["SK",2017,"Monetary","EORA",{"v":47.096625772120305,"d":"47.097"},"g/kWh"]
["SI",2017,"Monetary","EORA",{"v":240.43989643037057,"d":"240.440"},"g/kWh"]
["SE",2017,"Monetary","EORA",{"v":37.58820111755506,"d":"37.588"},"g/kWh"]
["US",2017,"Monetary","EORA",{"v":322.47193500265354,"d":"322.472"},"g/kWh"]
["AT",2017,"Monetary","GLORIA act",{"v":54.625093663590285,"d":"54.625"},"g/kWh"]
["BE",2017,"Monetary","GLORIA act",{"v":140.9605988706373,"d":"140.961"},"g/kWh"]
["BG",2017,"Monetary","GLORIA act",{"v":597.0284772027967,"d":"597.028"},"g/kWh"]
["CY",2017,"Monetary","GLORIA act",{"v":497.20533507833676,"d":"497.205"},"g/kWh"]
["CZ",2017,"Monetary","GLORIA act",{"v":333.15593070641484,"d":"333.156"},"g/kWh"]
["DE",2017,"Monetary","GLORIA act",{"v":217.13344495049378,"d":"217.133"},"g/kWh"]
["DK",2017,"Monetary","GLORIA act",{"v":127.20238494853098,"d":"127.202"},"g/kWh"]
["ES",2017,"Monetary","GLORIA act",{"v":174.39880956082942,"d":"174.399"},"g/kWh"]
["EE",2017,"Monetary","GLORIA act",{"v":450.1577115979869,"d":"450.158"},"g/kWh"]
["FI",2017,"Monetary","GLORIA act",{"v":128.64825045821723,"d":"128.648"},"g/kWh"]
["FR",2017,"Monetary","GLORIA act",{"v":40.57128460370302,"d":"40.571"},"g/kWh"]
["GR",2017,"Monetary","GLORIA act",{"v":251.46730812365382,"d":"251.467"},"g/kWh"]
["HR",2017,"Monetary","GLORIA act",{"v":99.91353614413826,"d":"99.914"},"g/kWh"]
["HU",2017,"Monetary","GLORIA act",{"v":197.18111406618954,"d":"197.181"},"g/kWh"]
["IE",2017,"Monetary","GLORIA act",{"v":310.20343241641393,"d":"310.203"},"g/kWh"]
["IT",2017,"Monetary","GLORIA act",{"v":151.11753579494248,"d":"151.118"},"g/kWh"]
["LT",2017,"Monetary","GLORIA act",{"v":57.62413901493956,"d":"57.624"},"g/kWh"]
["LU",2017,"Monetary","GLORIA act",{"v":14.090496538246224,"d":"14.090"},"g/kWh"]
["LV",2017,"Monetary","GLORIA act",{"v":62.31722344866235,"d":"62.317"},"g/kWh"]
["MT",2017,"Monetary","GLORIA act",{"v":82.19568103886401,"d":"82.196"},"g/kWh"]
["NL",2017,"Monetary","GLORIA act",{"v":239.1777756412812,"d":"239.178"},"g/kWh"]
["PL",2017,"Monetary","GLORIA act",{"v":551.5664462310704,"d":"551.566"},"g/kWh"]
["PT",2017,"Monetary","GLORIA act",{"v":149.69295710549432,"d":"149.693"},"g/kWh"]
["RO",2017,"Monetary","GLORIA act",{"v":223.12918815028274,"d":"223.129"},"g/kWh"]
["SK",2017,"Monetary","GLORIA act",{"v":86.18621028340593,"d":"86.186"},"g/kWh"]
["SI",2017,"Monetary","GLORIA act",{"v":160.86394139280875,"d":"160.864"},"g/kWh"]
["SE",2017,"Monetary","GLORIA act",{"v":36.374524037709776,"d":"36.375"},"g/kWh"]
["US",2017,"Monetary","GLORIA act",{"v":380.967798944558,"d":"380.968"},"g/kWh"]
["AT",2017,"Monetary","EXIOBASE ixi",{"v":24.8676990281184,"d":"24.868"},"g/kWh"]
["BE",2017,"Monetary","EXIOBASE ixi",{"v":120.054415132635,"d":"120.054"},"g/kWh"]
["BG",2017,"Monetary","EXIOBASE ixi",{"v":379.965205810826,"d":"379.965"},"g/kWh"]
["CY",2017,"Monetary","EXIOBASE ixi",{"v":441.622367376683,"d":"441.622"},"g/kWh"]
["CZ",2017,"Monetary","EXIOBASE ixi",{"v":249.896982872873,"d":"249.897"},"g/kWh"]
["DE",2017,"Monetary","EXIOBASE ixi",{"v":171.672964542431,"d":"171.673"},"g/kWh"]
["DK",2017,"Monetary","EXIOBASE ixi",{"v":11.156234106957,"d":"11.156"},"g/kWh"]
["EE",2017,"Monetary","EXIOBASE ixi",{"v":266.076275142821,"d":"266.076"},"g/kWh"]
["ES",2017,"Monetary","EXIOBASE ixi",{"v":232.698126393914,"d":"232.698"},"g/kWh"]
["FI",2017,"Monetary","EXIOBASE ixi",{"v":60.2132623498916,"d":"60.213"},"g/kWh"]
["FR",2017,"Monetary","EXIOBASE ixi",{"v":37.806615732441,"d":"37.807"},"g/kWh"]
["GR",2017,"Monetary","EXIOBASE ixi",{"v":176.700178860703,"d":"176.700"},"g/kWh"]
["HR",2017,"Monetary","EXIOBASE ixi",{"v":140.488175312077,"d":"140.488"},"g/kWh"]
["HU",2017,"Monetary","EXIOBASE ixi",{"v":126.90957135676,"d":"126.910"},"g/kWh"]
["IE",2017,"Monetary","EXIOBASE ixi",{"v":318.413011415811,"d":"318.413"},"g/kWh"]
["IT",2017,"Monetary","EXIOBASE ixi",{"v":189.689177064169,"d":"189.689"},"g/kWh"]
["LT",2017,"Monetary","EXIOBASE ixi",{"v":14.3544379918326,"d":"14.354"},"g/kWh"]
["LU",2017,"Monetary","EXIOBASE ixi",{"v":13.3492746211635,"d":"13.349"},"g/kWh"]
["LV",2017,"Monetary","EXIOBASE ixi",{"v":26.1844526962732,"d":"26.184"},"g/kWh"]
["MT",2017,"Monetary","EXIOBASE ixi",{"v":83.0253782962644,"d":"83.025"},"g/kWh"]
["NL",2017,"Monetary","EXIOBASE ixi",{"v":220.721895606876,"d":"220.722"},"g/kWh"]
["PL",2017,"Monetary","EXIOBASE ixi",{"v":427.726426390042,"d":"427.726"},"g/kWh"]
["PT",2017,"Monetary","EXIOBASE ixi",{"v":168.877506093332,"d":"168.878"},"g/kWh"]
["RO",2017,"Monetary","EXIOBASE ixi",{"v":291.774722661721,"d":"291.775"},"g/kWh"]
["SE",2017,"Monetary","EXIOBASE ixi",{"v":1.69457576867181,"d":"1.695"},"g/kWh"]
["SI",2017,"Monetary","EXIOBASE ixi",{"v":188.997308456425,"d":"188.997"},"g/kWh"]
["SK",2017,"Monetary","EXIOBASE ixi",{"v":86.1193303142107,"d":"86.119"},"g/kWh"]
["US",2017,"Monetary","EXIOBASE ixi",{"v":457.322286849646,"d":"457.322"},"g/kWh"]
["AT",2017,"Monetary","EXIOBASE pxp",{"v":18.7475724415882,"d":"18.748"},"g/kWh"]
["BE",2017,"Monetary","EXIOBASE pxp",{"v":103.125201265044,"d":"103.125"},"g/kWh"]
["BG",2017,"Monetary","EXIOBASE pxp",{"v":407.8823770168,"d":"407.882"},"g/kWh"]
["CY",2017,"Monetary","EXIOBASE pxp",{"v":442.8285894779,"d":"442.829"},"g/kWh"]
["CZ",2017,"Monetary","EXIOBASE pxp",{"v":253.699577888814,"d":"253.700"},"g/kWh"]
["DE",2017,"Monetary","EXIOBASE pxp",{"v":151.614803399639,"d":"151.615"},"g/kWh"]
["DK",2017,"Monetary","EXIOBASE pxp",{"v":6.8132106821033,"d":"6.813"},"g/kWh"]
["EE",2017,"Monetary","EXIOBASE pxp",{"v":238.383914536536,"d":"238.384"},"g/kWh"]
["ES",2017,"Monetary","EXIOBASE pxp",{"v":189.775448644112,"d":"189.775"},"g/kWh"]
["FI",2017,"Monetary","EXIOBASE pxp",{"v":51.8163762876683,"d":"51.816"},"g/kWh"]
["FR",2017,"Monetary","EXIOBASE pxp",{"v":37.7949331149978,"d":"37.795"},"g/kWh"]
["GR",2017,"Monetary","EXIOBASE pxp",{"v":175.327308588371,"d":"175.327"},"g/kWh"]
["HR",2017,"Monetary","EXIOBASE pxp",{"v":113.719211523646,"d":"113.719"},"g/kWh"]
["HU",2017,"Monetary","EXIOBASE pxp",{"v":132.035348019737,"d":"132.035"},"g/kWh"]
["IE",2017,"Monetary","EXIOBASE pxp",{"v":304.7048766265,"d":"304.705"},"g/kWh"]
["IT",2017,"Monetary","EXIOBASE pxp",{"v":175.588548357472,"d":"175.589"},"g/kWh"]
["LT",2017,"Monetary","EXIOBASE pxp",{"v":8.13438803657784,"d":"8.134"},"g/kWh"]
["LU",2017,"Monetary","EXIOBASE pxp",{"v":1.50968118214459,"d":"1.510"},"g/kWh"]
["LV",2017,"Monetary","EXIOBASE pxp",{"v":13.0958852569277,"d":"13.096"},"g/kWh"]
["MT",2017,"Monetary","EXIOBASE pxp",{"v":52.2290016511912,"d":"52.229"},"g/kWh"]
["NL",2017,"Monetary","EXIOBASE pxp",{"v":196.319581353431,"d":"196.320"},"g/kWh"]
["PL",2017,"Monetary","EXIOBASE pxp",{"v":372.211859144435,"d":"372.212"},"g/kWh"]
["PT",2017,"Monetary","EXIOBASE pxp",{"v":139.956236461886,"d":"139.956"},"g/kWh"]
["RO",2017,"Monetary","EXIOBASE pxp",{"v":291.760880994755,"d":"291.761"},"g/kWh"]
["SE",2017,"Monetary","EXIOBASE pxp",{"v":0.922205178177092,"d":"0.922"},"g/kWh"]
["SI",2017,"Monetary","EXIOBASE pxp",{"v":128.497421884971,"d":"128.497"},"g/kWh"]
["SK",2017,"Monetary","EXIOBASE pxp",{"v":40.1437452544528,"d":"40.144"},"g/kWh"]
["US",2017,"Monetary","EXIOBASE pxp",{"v":426.890841621651,"d":"426.891"},"g/kWh"]
["AT",2017,"Monetary","EMERGING",{"v":24.2727115600944,"d":"24.273"},"g/kWh"]
["BE",2017,"Monetary","EMERGING",{"v":20.4200307981398,"d":"20.420"},"g/kWh"]
["BG",2017,"Monetary","EMERGING",{"v":482.600423513271,"d":"482.600"},"g/kWh"]
["CY",2017,"Monetary","EMERGING",{"v":260.573449773239,"d":"260.573"},"g/kWh"]
["CZ",2017,"Monetary","EMERGING",{"v":167.745512356175,"d":"167.746"},"g/kWh"]
["DE",2017,"Monetary","EMERGING",{"v":285.340529887491,"d":"285.341"},"g/kWh"]
["DK",2017,"Monetary","EMERGING",{"v":47.5627596774052,"d":"47.563"},"g/kWh"]
["ES",2017,"Monetary","EMERGING",{"v":58.1285073214421,"d":"58.129"},"g/kWh"]
["EE",2017,"Monetary","EMERGING",{"v":555.075951483126,"d":"555.076"},"g/kWh"]
["FI",2017,"Monetary","EMERGING",{"v":115.291293988965,"d":"115.291"},"g/kWh"]
["FR",2017,"Monetary","EMERGING",{"v":25.0300163085229,"d":"25.030"},"g/kWh"]
["GR",2017,"Monetary","EMERGING",{"v":247.684133111494,"d":"247.684"},"g/kWh"]
["HR",2017,"Monetary","EMERGING",{"v":59.4284827361543,"d":"59.428"},"g/kWh"]
["HU",2017,"Monetary","EMERGING",{"v":82.9615957119342,"d":"82.962"},"g/kWh"]
["IE",2017,"Monetary","EMERGING",{"v":205.538038920898,"d":"205.538"},"g/kWh"]
["IT",2017,"Monetary","EMERGING",{"v":85.2660374929357,"d":"85.266"},"g/kWh"]
["LT",2017,"Monetary","EMERGING",{"v":5.7916042070239,"d":"5.792"},"g/kWh"]
["LU",2017,"Monetary","EMERGING",{"v":307.063869700749,"d":"307.064"},"g/kWh"]
["LV",2017,"Monetary","EMERGING",{"v":36.4377533884126,"d":"36.438"},"g/kWh"]
["MT",2017,"Monetary","EMERGING",{"v":216.758143886298,"d":"216.758"},"g/kWh"]
["NL",2017,"Monetary","EMERGING",{"v":239.577353628986,"d":"239.577"},"g/kWh"]
["PL",2017,"Monetary","EMERGING",{"v":352.804924629696,"d":"352.805"},"g/kWh"]
["PT",2017,"Monetary","EMERGING",{"v":252.396166320387,"d":"252.396"},"g/kWh"]
["RO",2017,"Monetary","EMERGING",{"v":127.096003075253,"d":"127.096"},"g/kWh"]
["SK",2017,"Monetary","EMERGING",{"v":52.0510304991388,"d":"52.051"},"g/kWh"]
["SI",2017,"Monetary","EMERGING",{"v":198.226083428878,"d":"198.226"},"g/kWh"]
["SE",2017,"Monetary","EMERGING",{"v":7.22630804307561,"d":"7.226"},"g/kWh"]
["US",2017,"Monetary","EMERGING",{"v":354.853607093162,"d":"354.854"},"g/kWh"]
["AT",2017,"Monetary","GTAP",{"v":198.51525624734055,"d":"198.515"},"g/kWh"]
["BE",2017,"Monetary","GTAP",{"v":188.0470781753025,"d":"188.047"},"g/kWh"]
["BG",2017,"Monetary","GTAP",{"v":403.5216279362095,"d":"403.522"},"g/kWh"]
["CY",2017,"Monetary","GTAP",{"v":117.12082350116052,"d":"117.121"},"g/kWh"]
["CZ",2017,"Monetary","GTAP",{"v":528.34790778211,"d":"528.348"},"g/kWh"]
["DE",2017,"Monetary","GTAP",{"v":630.8689781400808,"d":"630.869"},"g/kWh"]
["DK",2017,"Monetary","GTAP",{"v":174.41249057338382,"d":"174.412"},"g/kWh"]
["ES",2017,"Monetary","GTAP",{"v":289.99654573717606,"d":"289.997"},"g/kWh"]
["EE",2017,"Monetary","GTAP",{"v":211.5409123331052,"d":"211.541"},"g/kWh"]
["FI",2017,"Monetary","GTAP",{"v":187.84849540838005,"d":"187.848"},"g/kWh"]
["FR",2017,"Monetary","GTAP",{"v":103.06303413907003,"d":"103.063"},"g/kWh"]
["GR",2017,"Monetary","GTAP",{"v":706.2798957463516,"d":"706.280"},"g/kWh"]
["HR",2017,"Monetary","GTAP",{"v":302.9747478486717,"d":"302.975"},"g/kWh"]
["HU",2017,"Monetary","GTAP",{"v":265.83240837579706,"d":"265.832"},"g/kWh"]
["IE",2017,"Monetary","GTAP",{"v":582.5722531971903,"d":"582.572"},"g/kWh"]
["IT",2017,"Monetary","GTAP",{"v":315.8366312411613,"d":"315.837"},"g/kWh"]
["LT",2017,"Monetary","GTAP",{"v":64.04308348883019,"d":"64.043"},"g/kWh"]
["LU",2017,"Monetary","GTAP",{"v":172.77596669184484,"d":"172.776"},"g/kWh"]
["LV",2017,"Monetary","GTAP",{"v":148.87669157518232,"d":"148.877"},"g/kWh"]
["MT",2017,"Monetary","GTAP",{"v":518.8566141021971,"d":"518.857"},"g/kWh"]
["NL",2017,"Monetary","GTAP",{"v":444.7401959831758,"d":"444.740"},"g/kWh"]
["PL",2017,"Monetary","GTAP",{"v":726.9776206190135,"d":"726.978"},"g/kWh"]
["PT",2017,"Monetary","GTAP",{"v":481.55118213895366,"d":"481.551"},"g/kWh"]
["RO",2017,"Monetary","GTAP",{"v":369.7984981552844,"d":"369.798"},"g/kWh"]
["SK",2017,"Monetary","GTAP",{"v":267.3941478195572,"d":"267.394"},"g/kWh"]
["SI",2017,"Monetary","GTAP",{"v":335.98372041695046,"d":"335.984"},"g/kWh"]
["SE",2017,"Monetary","GTAP",{"v":28.600884300541324,"d":"28.601"},"g/kWh"]
["US",2017,"Monetary","GTAP",{"v":425.42248941105106,"d":"425.422"},"g/kWh"]
["AT",2023,"Physical","Electricity Maps",43.1470856352684,"g/kWh"]
["AT",2023,"Hybrid","EXIO Hybrid",86.778732693504,"g/kWh","generation shares from ENTSO-E"]
["BE",2023,"Physical","Electricity Maps",121.141616391957,"g/kWh"]
["BE",2023,"Hybrid","EXIO Hybrid",135.436494016862,"g/kWh","generation shares from ENTSO-E"]
["BG",2023,"Physical","Electricity Maps",405.077249098493,"g/kWh"]
["BG",2023,"Hybrid","EXIO Hybrid",405.83521384196,"g/kWh","generation shares from ENTSO-E"]
["CZ",2023,"Physical","Electricity Maps",440.537891760986,"g/kWh"]
["CZ",2023,"Hybrid","EXIO Hybrid",443.854775989763,"g/kWh","generation shares from ENTSO-E"]
["DE",2023,"Physical","Electricity Maps",328.283563880899,"g/kWh"]
["DE",2023,"Hybrid","EXIO Hybrid",335.989032771776,"g/kWh","generation shares from ENTSO-E"]
["DK",2023,"Physical","Electricity Maps",97.3162430297212,"g/kWh"]
["DK",2023,"Hybrid","EXIO Hybrid",133.421548934492,"g/kWh","generation shares from ENTSO-E"]
["EE",2023,"Physical","Electricity Maps",382.458517123082,"g/kWh"]
["EE",2023,"Hybrid","EXIO Hybrid",381.456932671516,"g/kWh","generation shares from ENTSO-E"]
["GR",2023,"Physical","Electricity Maps",277.549983116027,"g/kWh"]
["GR",2023,"Hybrid","EXIO Hybrid",313.16560186641,"g/kWh","generation shares from ENTSO-E"]
["ES",2023,"Physical","Electricity Maps",108.38834049378,"g/kWh"]
["ES",2023,"Hybrid","EXIO Hybrid",137.248234607984,"g/kWh","generation shares from ENTSO-E"]
["FI",2023,"Physical","Electricity Maps",47.6015804887368,"g/kWh"]
["FI",2023,"Hybrid","EXIO Hybrid",76.6709515147702,"g/kWh","generation shares from ENTSO-E"]
["FR",2023,"Physical","Electricity Maps",26.9108666199499,"g/kWh"]
["FR",2023,"Hybrid","EXIO Hybrid",43.7586509975264,"g/kWh","generation shares from ENTSO-E"]
["HR",2023,"Physical","Electricity Maps",164.677051902283,"g/kWh"]
["HR",2023,"Hybrid","EXIO Hybrid",198.039341642639,"g/kWh","generation shares from ENTSO-E"]
["HU",2023,"Physical","Electricity Maps",210.959167443189,"g/kWh"]
["HU",2023,"Hybrid","EXIO Hybrid",219.841033080565,"g/kWh","generation shares from ENTSO-E"]
["IE",2023,"Physical","Electricity Maps",299.496217352455,"g/kWh"]
["IE",2023,"Hybrid","EXIO Hybrid",304.41908507138,"g/kWh","generation shares from ENTSO-E"]
["IT",2023,"Physical","Electricity Maps",294.727286375012,"g/kWh"]
["IT",2023,"Hybrid","EXIO Hybrid",331.747962859068,"g/kWh","generation shares from ENTSO-E"]
["LT",2023,"Physical","Electricity Maps",57.4360307139693,"g/kWh"]
["LT",2023,"Hybrid","EXIO Hybrid",77.9803445036844,"g/kWh","generation shares from ENTSO-E"]
["LV",2023,"Physical","Electricity Maps",103.634036950648,"g/kWh"]
["LV",2023,"Hybrid","EXIO Hybrid",159.562268728157,"g/kWh","generation shares from ENTSO-E"]
["NL",2023,"Physical","Electricity Maps",405.869773683662,"g/kWh"]
["NL",2023,"Hybrid","EXIO Hybrid",261.452500801764,"g/kWh","generation shares from ENTSO-E"]
["PL",2023,"Physical","Electricity Maps",728.438480379316,"g/kWh"]
["PL",2023,"Hybrid","EXIO Hybrid",620.892704443904,"g/kWh","generation shares from ENTSO-E"]
["PT",2023,"Physical","Electricity Maps",86.6269073910136,"g/kWh"]
["PT",2023,"Hybrid","EXIO Hybrid",120.920084354369,"g/kWh","generation shares from ENTSO-E"]
["RO",2023,"Physical","Electricity Maps",272.785313010663,"g/kWh"]
["RO",2023,"Hybrid","EXIO Hybrid",265.597704088613,"g/kWh","generation shares from ENTSO-E"]
["SE",2023,"Physical","Electricity Maps",1.34285761234806,"g/kWh"]
["SE",2023,"Hybrid","EXIO Hybrid",0.0325183096535548,"g/kWh","generation shares from ENTSO-E"]
["SI",2023,"Physical","Electricity Maps",220.884840174579,"g/kWh"]
["SI",2023,"Hybrid","EXIO Hybrid",213.259027376758,"g/kWh","generation shares from ENTSO-E"]
["SK",2023,"Physical","Electricity Maps",97.6115797787352,"g/kWh"]
["SK",2023,"Hybrid","EXIO Hybrid",91.140581163509,"g/kWh","generation shares from ENTSO-E"]
["US",2023,"Physical","Electricity Maps",341.319498840341,"g/kWh"]
["US",2023,"Hybrid","EXIO Hybrid",359.447357573166,"g/kWh","generation shares from ENTSO-E"]
["AT",2023,"Monetary","EMERGING",214.036940135864,"g/kWh"]
["BE",2023,"Monetary","EMERGING",185.720995189695,"g/kWh"]
["BG",2023,"Monetary","EMERGING",185.440453483218,"g/kWh"]
["CY",2023,"Monetary","EMERGING",316.483937191983,"g/kWh"]
["CZ",2023,"Monetary","EMERGING",911.657967671818,"g/kWh"]
["DE",2023,"Monetary","EMERGING",176.231113251192,"g/kWh"]
["DK",2023,"Monetary","EMERGING",147.924351290426,"g/kWh"]
["ES",2023,"Monetary","EMERGING",95.430666303937,"g/kWh"]
["EE",2023,"Monetary","EMERGING",345.420057828167,"g/kWh"]
["FI",2023,"Monetary","EMERGING",71.9792738068509,"g/kWh"]
["FR",2023,"Monetary","EMERGING",61.0568183346385,"g/kWh"]
["GR",2023,"Monetary","EMERGING",461.329907508971,"g/kWh"]
["HR",2023,"Monetary","EMERGING",200.074042432233,"g/kWh"]
["HU",2023,"Monetary","EMERGING",342.716116333019,"g/kWh"]
["IE",2023,"Monetary","EMERGING",303.606351555155,"g/kWh"]
["IT",2023,"Monetary","EMERGING",170.48017727449,"g/kWh"]
["LT",2023,"Monetary","EMERGING",75.0651297224272,"g/kWh"]
["LU",2023,"Monetary","EMERGING",198.097670980379,"g/kWh"]
["LV",2023,"Monetary","EMERGING",352.62602967719,"g/kWh"]
["MT",2023,"Monetary","EMERGING",315.628765895602,"g/kWh"]
["NL",2023,"Monetary","EMERGING",163.356872216186,"g/kWh"]
["PL",2023,"Monetary","EMERGING",761.991798759939,"g/kWh"]
["PT",2023,"Monetary","EMERGING",128.622065034873,"g/kWh"]
["RO",2023,"Monetary","EMERGING",902.301593250669,"g/kWh"]
["SK",2023,"Monetary","EMERGING",329.172952563445,"g/kWh"]
["SI",2023,"Monetary","EMERGING",386.4518112607,"g/kWh"]
["SE",2023,"Monetary","EMERGING",13.7200850124078,"g/kWh"]
["US",2023,"Monetary","EMERGING",581.891269481104,"g/kWh"]

{"sheet":"LCCI by country","index":6,"n_rows":562,"n_cols":8,"rows_kept":562}
["Country","Year","DB type","Source","GWP100","Unit","Notes","Data from figure 2 in manuscript"]
["BE",2017,"Physical","JRC",{"v":230.388555151416,"d":"230.389"},"g/kWh"]
["BG",2017,"Physical","JRC",{"v":573.845753702202,"d":"573.846"},"g/kWh"]
["CZ",2017,"Physical","JRC",{"v":624.089843691911,"d":"624.090"},"g/kWh"]
["DK",2017,"Physical","JRC",{"v":170.596875513752,"d":"170.597"},"g/kWh"]
["DE",2017,"Physical","JRC",{"v":441.606336190274,"d":"441.606"},"g/kWh"]
["EE",2017,"Physical","JRC",{"v":725.1618439037651,"d":"725.162"},"g/kWh"]
["IE",2017,"Physical","JRC",{"v":401.09529651486196,"d":"401.095"},"g/kWh"]
["GR",2017,"Physical","JRC",{"v":651.403417464393,"d":"651.403"},"g/kWh"]
["ES",2017,"Physical","JRC",{"v":301.47472727138,"d":"301.475"},"g/kWh"]
["FR",2017,"Physical","JRC",{"v":86.1057675252705,"d":"86.106"},"g/kWh"]
["HR",2017,"Physical","JRC",{"v":385.976740925831,"d":"385.977"},"g/kWh"]
["IT",2017,"Physical","JRC",{"v":381.98744593601305,"d":"381.987"},"g/kWh"]
["CY",2017,"Physical","JRC",{"v":858.811902888308,"d":"858.812"},"g/kWh"]
["LV",2017,"Physical","JRC",{"v":477.03874876017,"d":"477.039"},"g/kWh"]
["LT",2017,"Physical","JRC",{"v":89.04153625098981,"d":"89.042"},"g/kWh"]
["LU",2017,"Physical","JRC",{"v":363.383756005322,"d":"363.384"},"g/kWh"]
["HU",2017,"Physical","JRC",{"v":289.24713013931,"d":"289.247"},"g/kWh"]
["MT",2017,"Physical","JRC",{"v":492.486586769273,"d":"492.487"},"g/kWh"]
["NL",2017,"Physical","JRC",{"v":476.348166648369,"d":"476.348"},"g/kWh"]
["AT",2017,"Physical","JRC",{"v":292.54487493272,"d":"292.545"},"g/kWh"]
["PL",2017,"Physical","JRC",{"v":872.772117162336,"d":"872.772"},"g/kWh"]
["PT",2017,"Physical","JRC",{"v":352.698875652606,"d":"352.699"},"g/kWh"]
["RO",2017,"Physical","JRC",{"v":503.368338125481,"d":"503.368"},"g/kWh"]
["SI",2017,"Physical","JRC",{"v":249.585651854157,"d":"249.586"},"g/kWh"]
["SK",2017,"Physical","JRC",{"v":397.29922222989103,"d":"397.299"},"g/kWh"]
["FI",2017,"Physical","JRC",{"v":95.4827773945797,"d":"95.483"},"g/kWh"]
["SE",2017,"Physical","JRC",{"v":27.4908864415033,"d":"27.491"},"g/kWh"]
["AT",2017,"Physical","Electricity Maps",{"v":156,"d":"156.000"},"g/kWh"]
["BE",2017,"Physical","Electricity Maps",{"v":203,"d":"203.000"},"g/kWh"]
["BG",2017,"Physical","Electricity Maps",{"v":552,"d":"552.000"},"g/kWh"]
["CY",2017,"Physical","Electricity Maps",897,"g/kWh"]
["CZ",2017,"Physical","Electricity Maps",601,"g/kWh"]
["DE",2017,"Physical","Electricity Maps",520,"g/kWh"]
["DK",2017,"Physical","Electricity Maps",294,"g/kWh"]
["EE",2017,"Physical","Electricity Maps",778,"g/kWh"]
["ES",2017,"Physical","Electricity Maps",329,"g/kWh"]
["FI",2017,"Physical","Electricity Maps",229,"g/kWh"]
["FR",2017,"Physical","Electricity Maps",72,"g/kWh"]
["GR",2017,"Physical","Electricity Maps",776,"g/kWh"]
["HR",2017,"Physical","Electricity Maps",261,"g/kWh"]
["HU",2017,"Physical","Electricity Maps",354,"g/kWh"]
["IE",2017,"Physical","Electricity Maps",409,"g/kWh"]
["IT",2017,"Physical","Electricity Maps",456,"g/kWh"]
["LT",2017,"Physical","Electricity Maps",190,"g/kWh"]
["LV",2017,"Physical","Electricity Maps",211,"g/kWh"]
["NL",2017,"Physical","Electricity Maps",579,"g/kWh"]
["PL",2017,"Physical","Electricity Maps",956,"g/kWh"]
["PT",2017,"Physical","Electricity Maps",476,"g/kWh"]
["RO",2017,"Physical","Electricity Maps",488,"g/kWh"]
["SE",2017,"Physical","Electricity Maps",20,"g/kWh"]
["SI",2017,"Physical","Electricity Maps",327,"g/kWh"]
["SK",2017,"Physical","Electricity Maps",234,"g/kWh"]
["US",2017,"Physical","Electricity Maps",468,"g/kWh"]
["AT",2017,"Physical","EMBER",163,"g/kWh"]
["BE",2017,"Physical","EMBER",159,"g/kWh"]
["BG",2017,"Physical","EMBER",503,"g/kWh"]
["CY",2017,"Physical","EMBER",606,"g/kWh"]
["CZ",2017,"Physical","EMBER",542,"g/kWh"]
["DE",2017,"Physical","EMBER",470,"g/kWh"]
["DK",2017,"Physical","EMBER",283,"g/kWh"]
["EE",2017,"Physical","EMBER",583,"g/kWh"]
["ES",2017,"Physical","EMBER",329,"g/kWh"]
["FI",2017,"Physical","EMBER",186,"g/kWh"]
["FR",2017,"Physical","EMBER",78.3,"g/kWh"]
["GR",2017,"Physical","EMBER",580,"g/kWh"]
["HR",2017,"Physical","EMBER",256,"g/kWh"]
["HU",2017,"Physical","EMBER",291,"g/kWh"]
["IE",2017,"Physical","EMBER",404,"g/kWh"]
["IT",2017,"Physical","EMBER",393,"g/kWh"]
["LT",2017,"Physical","EMBER",183,"g/kWh"]
["LV",2017,"Physical","EMBER",141,"g/kWh"]
["NL",2017,"Physical","EMBER",490,"g/kWh"]
["PL",2017,"Physical","EMBER",806,"g/kWh"]
["PT",2017,"Physical","EMBER",434,"g/kWh"]
["RO",2017,"Physical","EMBER",369,"g/kWh"]
["SE",2017,"Physical","EMBER",42.5,"g/kWh"]
["SI",2017,"Physical","EMBER",318,"g/kWh"]
["SK",2017,"Physical","EMBER",183,"g/kWh"]
["US",2017,"Physical","EMBER",469,"g/kWh"]
["AT",2017,"Hybrid","EXIO Hybrid",{"v":430.33541285864,"d":"430"},"g/kWh","generation shares from ENTSO-E"]
["AT",2017,"Physical","NREL",{"v":126.763079335538,"d":"127"},"g/kWh","generation shares from ENTSO-E"]
["AT",2017,"Physical","IPCC",{"v":131.242990075727,"d":"131"},"g/kWh","generation shares from ENTSO-E"]
["BE",2017,"Hybrid","EXIO Hybrid",{"v":322.754849089848,"d":"323"},"g/kWh","generation shares from ENTSO-E"]
["BE",2017,"Physical","NREL",{"v":163.018461452407,"d":"163"},"g/kWh","generation shares from ENTSO-E"]
["BE",2017,"Physical","IPCC",{"v":163.10527269323,"d":"163"},"g/kWh","generation shares from ENTSO-E"]
["BG",2017,"Hybrid","EXIO Hybrid",{"v":816.818512395285,"d":"817"},"g/kWh","generation shares from ENTSO-E"]
["BG",2017,"Physical","NREL",{"v":489.598867516456,"d":"490"},"g/kWh","generation shares from ENTSO-E"]
["BG",2017,"Physical","IPCC",{"v":414.849096775665,"d":"415"},"g/kWh","generation shares from ENTSO-E"]
["CZ",2017,"Hybrid","EXIO Hybrid",{"v":1164.76073465483,"d":"1165"},"g/kWh","generation shares from ENTSO-E"]
["CZ",2017,"Physical","NREL",{"v":533.732465312445,"d":"534"},"g/kWh","generation shares from ENTSO-E"]
["CZ",2017,"Physical","IPCC",{"v":452.130052426506,"d":"452"},"g/kWh","generation shares from ENTSO-E"]
["DE",2017,"Hybrid","EXIO Hybrid",{"v":761.224172274081,"d":"761"},"g/kWh","generation shares from ENTSO-E"]
["DE",2017,"Physical","NREL",{"v":470.794870307167,"d":"471"},"g/kWh","generation shares from ENTSO-E"]
["DE",2017,"Physical","IPCC",{"v":409.880109215017,"d":"410"},"g/kWh","generation shares from ENTSO-E"]
["DK",2017,"Hybrid","EXIO Hybrid",{"v":471.119662558958,"d":"471"},"g/kWh","generation shares from ENTSO-E"]
["DK",2017,"Physical","NREL",{"v":293.691688173306,"d":"294"},"g/kWh","generation shares from ENTSO-E"]
["DK",2017,"Physical","IPCC",{"v":262.812045041012,"d":"263"},"g/kWh","generation shares from ENTSO-E"]
["EE",2017,"Hybrid","EXIO Hybrid",{"v":1406.68201865837,"d":"1407"},"g/kWh","generation shares from ENTSO-E"]
["EE",2017,"Physical","NREL",{"v":789.087513091916,"d":"789"},"g/kWh","generation shares from ENTSO-E"]
["EE",2017,"Physical","IPCC",{"v":782.286269562617,"d":"782"},"g/kWh","generation shares from ENTSO-E"]
["GR",2017,"Hybrid","EXIO Hybrid",{"v":831.495916485166,"d":"831"},"g/kWh","generation shares from ENTSO-E"]
["GR",2017,"Physical","NREL",{"v":553.866618313399,"d":"554"},"g/kWh","generation shares from ENTSO-E"]
["GR",2017,"Physical","IPCC",{"v":494.790972952963,"d":"495"},"g/kWh","generation shares from ENTSO-E"]
["ES",2017,"Hybrid","EXIO Hybrid",{"v":599.671462830354,"d":"600"},"g/kWh","generation shares from ENTSO-E"]
["ES",2017,"Physical","NREL",{"v":307.652466233559,"d":"308"},"g/kWh","generation shares from ENTSO-E"]
["ES",2017,"Physical","IPCC",{"v":280.242680563106,"d":"280"},"g/kWh","generation shares from ENTSO-E"]
["FI",2017,"Hybrid","EXIO Hybrid",{"v":627.107029124665,"d":"627"},"g/kWh","generation shares from ENTSO-E"]
["FI",2017,"Physical","NREL",{"v":223.210252076861,"d":"223"},"g/kWh","generation shares from ENTSO-E"]
["FI",2017,"Physical","IPCC",{"v":200.90553040558,"d":"201"},"g/kWh","generation shares from ENTSO-E"]
["FR",2017,"Hybrid","EXIO Hybrid",{"v":199.5382689619,"d":"200"},"g/kWh","generation shares from ENTSO-E"]
["FR",2017,"Physical","NREL",{"v":74.7433703198906,"d":"75"},"g/kWh","generation shares from ENTSO-E"]
["FR",2017,"Physical","IPCC",{"v":72.3443795929794,"d":"72"},"g/kWh","generation shares from ENTSO-E"]
["HR",2017,"Hybrid","EXIO Hybrid",{"v":432.947486809655,"d":"433"},"g/kWh","generation shares from ENTSO-E"]
["HR",2017,"Physical","NREL",{"v":259.009174311926,"d":"259"},"g/kWh","generation shares from ENTSO-E"]
["HR",2017,"Physical","IPCC",{"v":246.688073394495,"d":"247"},"g/kWh","generation shares from ENTSO-E"]
["HU",2017,"Hybrid","EXIO Hybrid",{"v":454.569702210075,"d":"455"},"g/kWh","generation shares from ENTSO-E"]
["HU",2017,"Physical","NREL",{"v":296.503621153509,"d":"297"},"g/kWh","generation shares from ENTSO-E"]
["HU",2017,"Physical","IPCC",{"v":270.040391731327,"d":"270"},"g/kWh","generation shares from ENTSO-E"]
["IE",2017,"Hybrid","EXIO Hybrid",{"v":775.996568786361,"d":"776"},"g/kWh","generation shares from ENTSO-E"]
["IE",2017,"Physical","NREL",{"v":488.424513451321,"d":"488"},"g/kWh","generation shares from ENTSO-E"]
["IE",2017,"Physical","IPCC",{"v":453.496781830103,"d":"453"},"g/kWh","generation shares from ENTSO-E"]
["IT",2017,"Hybrid","EXIO Hybrid",{"v":720.438109712359,"d":"720"},"g/kWh","generation shares from ENTSO-E"]
["IT",2017,"Physical","NREL",{"v":339.897108941226,"d":"340"},"g/kWh","generation shares from ENTSO-E"]
["IT",2017,"Physical","IPCC",{"v":322.423349682108,"d":"322"},"g/kWh","generation shares from ENTSO-E"]
["LT",2017,"Hybrid","EXIO Hybrid",{"v":284.476305134729,"d":"284"},"g/kWh","generation shares from ENTSO-E"]
["LT",2017,"Physical","NREL",{"v":142.55640551513,"d":"143"},"g/kWh","generation shares from ENTSO-E"]
["LT",2017,"Physical","IPCC",{"v":146.581444340072,"d":"147"},"g/kWh","generation shares from ENTSO-E"]
["LV",2017,"Hybrid","EXIO Hybrid",{"v":252.123515180604,"d":"252"},"g/kWh","generation shares from ENTSO-E"]
["LV",2017,"Physical","NREL",{"v":139.731769775953,"d":"140"},"g/kWh","generation shares from ENTSO-E"]
["LV",2017,"Physical","IPCC",{"v":149.212424095149,"d":"149"},"g/kWh","generation shares from ENTSO-E"]
["NL",2017,"Hybrid","EXIO Hybrid",{"v":663.793767413947,"d":"664"},"g/kWh","generation shares from ENTSO-E"]
["NL",2017,"Physical","NREL",{"v":618.265168265679,"d":"618"},"g/kWh","generation shares from ENTSO-E"]
["NL",2017,"Physical","IPCC",{"v":560.591163735198,"d":"561"},"g/kWh","generation shares from ENTSO-E"]
["PL",2017,"Hybrid","EXIO Hybrid",{"v":1641.52595865028,"d":"1642"},"g/kWh","generation shares from ENTSO-E"]
["PL",2017,"Physical","NREL",{"v":843.814702084928,"d":"844"},"g/kWh","generation shares from ENTSO-E"]
["PL",2017,"Physical","IPCC",{"v":711.590664021159,"d":"712"},"g/kWh","generation shares from ENTSO-E"]
["PT",2017,"Hybrid","EXIO Hybrid",{"v":724.825148034035,"d":"725"},"g/kWh","generation shares from ENTSO-E"]
["PT",2017,"Physical","NREL",{"v":420.91612446686,"d":"421"},"g/kWh","generation shares from ENTSO-E"]
["PT",2017,"Physical","IPCC",{"v":383.216395741781,"d":"383"},"g/kWh","generation shares from ENTSO-E"]
["RO",2017,"Hybrid","EXIO Hybrid",{"v":547.702634022876,"d":"548"},"g/kWh","generation shares from ENTSO-E"]
["RO",2017,"Physical","NREL",{"v":358.499096964775,"d":"358"},"g/kWh","generation shares from ENTSO-E"]
["RO",2017,"Physical","IPCC",{"v":317.846935983284,"d":"318"},"g/kWh","generation shares from ENTSO-E"]
["SE",2017,"Hybrid","EXIO Hybrid",{"v":10.4414360915688,"d":"10"},"g/kWh","generation shares from ENTSO-E"]
["SE",2017,"Physical","NREL",{"v":11.9711829405521,"d":"12"},"g/kWh","generation shares from ENTSO-E"]
["SE",2017,"Physical","IPCC",{"v":17.2486662524726,"d":"17"},"g/kWh","generation shares from ENTSO-E"]
["SI",2017,"Hybrid","EXIO Hybrid",{"v":383.77248882799,"d":"384"},"g/kWh","generation shares from ENTSO-E"]
["SI",2017,"Physical","NREL",{"v":302.363279773629,"d":"302"},"g/kWh","generation shares from ENTSO-E"]
["SI",2017,"Physical","IPCC",{"v":259.250302451453,"d":"259"},"g/kWh","generation shares from ENTSO-E"]
["SK",2017,"Hybrid","EXIO Hybrid",{"v":272.577197423538,"d":"273"},"g/kWh","generation shares from ENTSO-E"]
["SK",2017,"Physical","NREL",{"v":147.152045966486,"d":"147"},"g/kWh","generation shares from ENTSO-E"]
["SK",2017,"Physical","IPCC",{"v":133.473394474002,"d":"133"},"g/kWh","generation shares from ENTSO-E"]
["US",2017,"Hybrid","EXIO Hybrid",{"v":842.675452154893,"d":"843"},"g/kWh","generation shares from ENTSO-E"]
["US",2017,"Physical","NREL",{"v":473.878803046379,"d":"474"},"g/kWh","generation shares from ENTSO-E"]
["US",2017,"Physical","IPCC",{"v":423.825490561322,"d":"424"},"g/kWh","generation shares from ENTSO-E"]
["AT",2017,"Monetary","EXIOBASE pxp",{"v":64.26481545102,"d":"64"},"g/kWh"]
["BE",2017,"Monetary","EXIOBASE pxp",{"v":133.058553638512,"d":"133"},"g/kWh"]
["BG",2017,"Monetary","EXIOBASE pxp",{"v":443.016560952193,"d":"443"},"g/kWh"]
["CY",2017,"Monetary","EXIOBASE pxp",{"v":508.760375106235,"d":"509"},"g/kWh"]
["CZ",2017,"Monetary","EXIOBASE pxp",{"v":307.799784953648,"d":"308"},"g/kWh"]
["DE",2017,"Monetary","EXIOBASE pxp",{"v":186.771182518975,"d":"187"},"g/kWh"]
["DK",2017,"Monetary","EXIOBASE pxp",{"v":17.175492012231,"d":"17"},"g/kWh"]
["EE",2017,"Monetary","EXIOBASE pxp",{"v":260.721087907224,"d":"261"},"g/kWh"]
["ES",2017,"Monetary","EXIOBASE pxp",{"v":214.663413820495,"d":"215"},"g/kWh"]
["FI",2017,"Monetary","EXIOBASE pxp",{"v":62.889255658774,"d":"63"},"g/kWh"]
["FR",2017,"Monetary","EXIOBASE pxp",{"v":63.0061264428128,"d":"63"},"g/kWh"]
["GR",2017,"Monetary","EXIOBASE pxp",{"v":231.742310682493,"d":"232"},"g/kWh"]
["HR",2017,"Monetary","EXIOBASE pxp",{"v":180.1274006337,"d":"180"},"g/kWh"]
["HU",2017,"Monetary","EXIOBASE pxp",{"v":158.756266208056,"d":"159"},"g/kWh"]
["IE",2017,"Monetary","EXIOBASE pxp",{"v":328.640575645619,"d":"329"},"g/kWh"]
["IT",2017,"Monetary","EXIOBASE pxp",{"v":226.83017901127,"d":"227"},"g/kWh"]
["LT",2017,"Monetary","EXIOBASE pxp",{"v":36.8210148532313,"d":"37"},"g/kWh"]
["LU",2017,"Monetary","EXIOBASE pxp",{"v":43.1404882315478,"d":"43"},"g/kWh"]
["LV",2017,"Monetary","EXIOBASE pxp",{"v":35.3553512531757,"d":"35"},"g/kWh"]
["MT",2017,"Monetary","EXIOBASE pxp",{"v":141.791313019802,"d":"142"},"g/kWh"]
["NL",2017,"Monetary","EXIOBASE pxp",{"v":231.545821972892,"d":"232"},"g/kWh"]
["PL",2017,"Monetary","EXIOBASE pxp",{"v":404.150612698974,"d":"404"},"g/kWh"]
["PT",2017,"Monetary","EXIOBASE pxp",{"v":250.611186367064,"d":"251"},"g/kWh"]
["RO",2017,"Monetary","EXIOBASE pxp",{"v":360.53915231144,"d":"361"},"g/kWh"]
["SE",2017,"Monetary","EXIOBASE pxp",{"v":8.70019714607922,"d":"9"},"g/kWh"]
["SI",2017,"Monetary","EXIOBASE pxp",{"v":152.765708036443,"d":"153"},"g/kWh"]
["SK",2017,"Monetary","EXIOBASE pxp",{"v":107.649933074196,"d":"108"},"g/kWh"]
["US",2017,"Monetary","EXIOBASE pxp",{"v":434.205925952575,"d":"434"},"g/kWh"]
["AT",2017,"Monetary","EXIOBASE ixi",{"v":73.6006465109312,"d":"74"},"g/kWh"]
["BE",2017,"Monetary","EXIOBASE ixi",{"v":150.603430578194,"d":"151"},"g/kWh"]
["BG",2017,"Monetary","EXIOBASE ixi",{"v":418.167885316954,"d":"418"},"g/kWh"]
["CY",2017,"Monetary","EXIOBASE ixi",{"v":507.015568224276,"d":"507"},"g/kWh"]
["CZ",2017,"Monetary","EXIOBASE ixi",{"v":304.678135005707,"d":"305"},"g/kWh"]
["DE",2017,"Monetary","EXIOBASE ixi",{"v":206.53895479306,"d":"207"},"g/kWh"]
["DK",2017,"Monetary","EXIOBASE ixi",{"v":30.1170478200887,"d":"30"},"g/kWh"]
["EE",2017,"Monetary","EXIOBASE ixi",{"v":290.893520216821,"d":"291"},"g/kWh"]
["ES",2017,"Monetary","EXIOBASE ixi",{"v":259.854352633433,"d":"260"},"g/kWh"]
["FI",2017,"Monetary","EXIOBASE ixi",{"v":70.9130068214398,"d":"71"},"g/kWh"]
["FR",2017,"Monetary","EXIOBASE ixi",{"v":62.7787155338539,"d":"63"},"g/kWh"]
["GR",2017,"Monetary","EXIOBASE ixi",{"v":246.704204861369,"d":"247"},"g/kWh"]
["HR",2017,"Monetary","EXIOBASE ixi",{"v":213.073026924602,"d":"213"},"g/kWh"]
["HU",2017,"Monetary","EXIOBASE ixi",{"v":152.726084178552,"d":"153"},"g/kWh"]
["IE",2017,"Monetary","EXIOBASE ixi",{"v":343.131429637519,"d":"343"},"g/kWh"]
["IT",2017,"Monetary","EXIOBASE ixi",{"v":243.318691842478,"d":"243"},"g/kWh"]
["LT",2017,"Monetary","EXIOBASE ixi",{"v":44.8250761685431,"d":"45"},"g/kWh"]
["LU",2017,"Monetary","EXIOBASE ixi",{"v":73.8953721845488,"d":"74"},"g/kWh"]
["LV",2017,"Monetary","EXIOBASE ixi",{"v":55.1310888329613,"d":"55"},"g/kWh"]
["MT",2017,"Monetary","EXIOBASE ixi",{"v":190.146788486087,"d":"190"},"g/kWh"]
["NL",2017,"Monetary","EXIOBASE ixi",{"v":256.590592100254,"d":"257"},"g/kWh"]
["PL",2017,"Monetary","EXIOBASE ixi",{"v":460.653154638813,"d":"461"},"g/kWh"]
["PT",2017,"Monetary","EXIOBASE ixi",{"v":290.17637492933,"d":"290"},"g/kWh"]
["RO",2017,"Monetary","EXIOBASE ixi",{"v":360.450328206166,"d":"360"},"g/kWh"]
["SE",2017,"Monetary","EXIOBASE ixi",{"v":9.45708074571106,"d":"9"},"g/kWh"]
["SI",2017,"Monetary","EXIOBASE ixi",{"v":217.939370803758,"d":"218"},"g/kWh"]
["SK",2017,"Monetary","EXIOBASE ixi",{"v":167.994764763377,"d":"168"},"g/kWh"]
["US",2017,"Monetary","EXIOBASE ixi",{"v":464.423931318938,"d":"464"},"g/kWh"]
["AT",2017,"Monetary","EORA",{"v":103.24726745718563,"d":"103"},"g/kWh"]
["BE",2017,"Monetary","EORA",{"v":209.198119875687,"d":"209"},"g/kWh"]
["BG",2017,"Monetary","EORA",{"v":386.52599274316464,"d":"387"},"g/kWh"]
["CY",2017,"Monetary","EORA",{"v":789.3611582189972,"d":"789"},"g/kWh"]
["CZ",2017,"Monetary","EORA",{"v":471.2406275195495,"d":"471"},"g/kWh"]
["DE",2017,"Monetary","EORA",{"v":198.76947536578484,"d":"199"},"g/kWh"]
["DK",2017,"Monetary","EORA",{"v":216.45681181647194,"d":"216"},"g/kWh"]
["ES",2017,"Monetary","EORA",{"v":236.53216132881488,"d":"237"},"g/kWh"]
["EE",2017,"Monetary","EORA",{"v":582.4438168951431,"d":"582"},"g/kWh"]
["FI",2017,"Monetary","EORA",{"v":247.19250372024797,"d":"247"},"g/kWh"]
["FR",2017,"Monetary","EORA",{"v":78.0972766549417,"d":"78"},"g/kWh"]
["GR",2017,"Monetary","EORA",{"v":587.4889650167223,"d":"587"},"g/kWh"]
["HR",2017,"Monetary","EORA",{"v":237.54521660524125,"d":"238"},"g/kWh"]
["HU",2017,"Monetary","EORA",{"v":239.446076362253,"d":"239"},"g/kWh"]
["IE",2017,"Monetary","EORA",{"v":381.48787789962637,"d":"381"},"g/kWh"]
["IT",2017,"Monetary","EORA",{"v":246.1643417810046,"d":"246"},"g/kWh"]
["LT",2017,"Monetary","EORA",{"v":247.2907263656433,"d":"247"},"g/kWh"]
["LU",2017,"Monetary","EORA",{"v":108.25988527666351,"d":"108"},"g/kWh"]
["LV",2017,"Monetary","EORA",{"v":249.3437247126456,"d":"249"},"g/kWh"]
["MT",2017,"Monetary","EORA",{"v":586.7440023073067,"d":"587"},"g/kWh"]
["NL",2017,"Monetary","EORA",{"v":215.60886599445126,"d":"216"},"g/kWh"]
["PL",2017,"Monetary","EORA",{"v":374.5554985393239,"d":"375"},"g/kWh"]
["PT",2017,"Monetary","EORA",{"v":243.25475436881885,"d":"243"},"g/kWh"]
["RO",2017,"Monetary","EORA",{"v":404.05227348073885,"d":"404"},"g/kWh"]
["SK",2017,"Monetary","EORA",{"v":163.4266573076573,"d":"163"},"g/kWh"]
["SI",2017,"Monetary","EORA",{"v":416.41048495252915,"d":"416"},"g/kWh"]
["SE",2017,"Monetary","EORA",{"v":44.29204298392828,"d":"44"},"g/kWh"]
["US",2017,"Monetary","EORA",{"v":362.4010250255161,"d":"362"},"g/kWh"]
["AT",2017,"Monetary","GLORIA act",{"v":155.19405001806453,"d":"155"},"g/kWh"]
["BE",2017,"Monetary","GLORIA act",{"v":187.5059658998439,"d":"188"},"g/kWh"]
["BG",2017,"Monetary","GLORIA act",{"v":731.6025309551366,"d":"732"},"g/kWh"]
["CY",2017,"Monetary","GLORIA act",{"v":554.3883511611996,"d":"554"},"g/kWh"]
["CZ",2017,"Monetary","GLORIA act",{"v":461.59442015728837,"d":"462"},"g/kWh"]
["DE",2017,"Monetary","GLORIA act",{"v":270.3431342341753,"d":"270"},"g/kWh"]
["DK",2017,"Monetary","GLORIA act",{"v":154.37124116550294,"d":"154"},"g/kWh"]
["ES",2017,"Monetary","GLORIA act",{"v":270.7157981176761,"d":"271"},"g/kWh"]
["EE",2017,"Monetary","GLORIA act",{"v":647.2946796378658,"d":"647"},"g/kWh"]
["FI",2017,"Monetary","GLORIA act",{"v":157.88361165686646,"d":"158"},"g/kWh"]
["FR",2017,"Monetary","GLORIA act",{"v":105.607204396149,"d":"106"},"g/kWh"]
["GR",2017,"Monetary","GLORIA act",{"v":329.0621297764388,"d":"329"},"g/kWh"]
["HR",2017,"Monetary","GLORIA act",{"v":155.28209425214328,"d":"155"},"g/kWh"]
["HU",2017,"Monetary","GLORIA act",{"v":234.3272029003571,"d":"234"},"g/kWh"]
["IE",2017,"Monetary","GLORIA act",{"v":395.5839179144067,"d":"396"},"g/kWh"]
["IT",2017,"Monetary","GLORIA act",{"v":284.7114374443848,"d":"285"},"g/kWh"]
["LT",2017,"Monetary","GLORIA act",{"v":93.36432439294634,"d":"93"},"g/kWh"]
["LU",2017,"Monetary","GLORIA act",{"v":38.69539224863765,"d":"39"},"g/kWh"]
["LV",2017,"Monetary","GLORIA act",{"v":147.1286203565327,"d":"147"},"g/kWh"]
["MT",2017,"Monetary","GLORIA act",{"v":246.17108162604393,"d":"246"},"g/kWh"]
["NL",2017,"Monetary","GLORIA act",{"v":305.6231338194566,"d":"306"},"g/kWh"]
["PL",2017,"Monetary","GLORIA act",{"v":629.1947580835973,"d":"629"},"g/kWh"]
["PT",2017,"Monetary","GLORIA act",{"v":282.51837765171126,"d":"283"},"g/kWh"]
["RO",2017,"Monetary","GLORIA act",{"v":311.92810667236773,"d":"312"},"g/kWh"]
["SK",2017,"Monetary","GLORIA act",{"v":238.9493068715071,"d":"239"},"g/kWh"]
["SI",2017,"Monetary","GLORIA act",{"v":211.220001007257,"d":"211"},"g/kWh"]
["SE",2017,"Monetary","GLORIA act",{"v":48.32666211569746,"d":"48"},"g/kWh"]
["US",2017,"Monetary","GLORIA act",{"v":412.9900080426205,"d":"413"},"g/kWh"]
["AT",2017,"Monetary","GLORIA 0.6 com",{"v":155.19209004106253,"d":"155"},"g/kWh"]
["BE",2017,"Monetary","GLORIA 0.6 com",{"v":187.5086407499271,"d":"188"},"g/kWh"]
["BG",2017,"Monetary","GLORIA 0.6 com",{"v":731.5938456015629,"d":"732"},"g/kWh"]
["CY",2017,"Monetary","GLORIA 0.6 com",{"v":554.3837909793822,"d":"554"},"g/kWh"]
["CZ",2017,"Monetary","GLORIA 0.6 com",{"v":461.584811306268,"d":"462"},"g/kWh"]
["DE",2017,"Monetary","GLORIA 0.6 com",{"v":270.3524716145071,"d":"270"},"g/kWh"]
["DK",2017,"Monetary","GLORIA 0.6 com",{"v":154.37088894430437,"d":"154"},"g/kWh"]
["ES",2017,"Monetary","GLORIA 0.6 com",{"v":270.7195462563051,"d":"271"},"g/kWh"]
["EE",2017,"Monetary","GLORIA 0.6 com",{"v":647.2916138703093,"d":"647"},"g/kWh"]
["FI",2017,"Monetary","GLORIA 0.6 com",{"v":157.88295351773914,"d":"158"},"g/kWh"]
["FR",2017,"Monetary","GLORIA 0.6 com",{"v":105.60367815218129,"d":"106"},"g/kWh"]
["GR",2017,"Monetary","GLORIA 0.6 com",{"v":329.0710176515429,"d":"329"},"g/kWh"]
["HR",2017,"Monetary","GLORIA 0.6 com",{"v":155.2842359763172,"d":"155"},"g/kWh"]
["HU",2017,"Monetary","GLORIA 0.6 com",{"v":234.32937009364827,"d":"234"},"g/kWh"]
["IE",2017,"Monetary","GLORIA 0.6 com",{"v":395.5856537246439,"d":"396"},"g/kWh"]
["IT",2017,"Monetary","GLORIA 0.6 com",{"v":284.7102637570022,"d":"285"},"g/kWh"]
["LT",2017,"Monetary","GLORIA 0.6 com",{"v":93.36601215723589,"d":"93"},"g/kWh"]
["LU",2017,"Monetary","GLORIA 0.6 com",{"v":38.69546715806768,"d":"39"},"g/kWh"]
["LV",2017,"Monetary","GLORIA 0.6 com",{"v":147.12668534785973,"d":"147"},"g/kWh"]
["MT",2017,"Monetary","GLORIA 0.6 com",{"v":246.17017325721218,"d":"246"},"g/kWh"]
["NL",2017,"Monetary","GLORIA 0.6 com",{"v":305.63060235616024,"d":"306"},"g/kWh"]
["PL",2017,"Monetary","GLORIA 0.6 com",{"v":629.1953345874863,"d":"629"},"g/kWh"]
["PT",2017,"Monetary","GLORIA 0.6 com",{"v":282.5098961627722,"d":"283"},"g/kWh"]
["RO",2017,"Monetary","GLORIA 0.6 com",{"v":311.9362181816943,"d":"312"},"g/kWh"]
["SK",2017,"Monetary","GLORIA 0.6 com",{"v":238.950351950244,"d":"239"},"g/kWh"]
["SI",2017,"Monetary","GLORIA 0.6 com",{"v":211.21727840576688,"d":"211"},"g/kWh"]
["SE",2017,"Monetary","GLORIA 0.6 com",{"v":48.32547943171204,"d":"48"},"g/kWh"]
["US",2017,"Monetary","GLORIA 0.6 com",{"v":412.99734901953013,"d":"413"},"g/kWh"]
["AT",2017,"Monetary","EMERGING",{"v":66.4088106037095,"d":"66"},"g/kWh"]
["BE",2017,"Monetary","EMERGING",{"v":80.1962169691393,"d":"80"},"g/kWh"]
["BG",2017,"Monetary","EMERGING",{"v":749.402474932384,"d":"749"},"g/kWh"]
["CY",2017,"Monetary","EMERGING",{"v":439.988045359648,"d":"440"},"g/kWh"]
["CZ",2017,"Monetary","EMERGING",{"v":245.053103699593,"d":"245"},"g/kWh"]
["DE",2017,"Monetary","EMERGING",{"v":393.658132575704,"d":"394"},"g/kWh"]
["DK",2017,"Monetary","EMERGING",{"v":70.5109620457102,"d":"71"},"g/kWh"]
["ES",2017,"Monetary","EMERGING",{"v":137.948550062581,"d":"138"},"g/kWh"]
["EE",2017,"Monetary","EMERGING",{"v":746.388584176255,"d":"746"},"g/kWh"]
["FI",2017,"Monetary","EMERGING",{"v":152.35186906674,"d":"152"},"g/kWh"]
["FR",2017,"Monetary","EMERGING",{"v":59.1521232190004,"d":"59"},"g/kWh"]
["GR",2017,"Monetary","EMERGING",{"v":415.907532338337,"d":"416"},"g/kWh"]
["HR",2017,"Monetary","EMERGING",{"v":116.226797087067,"d":"116"},"g/kWh"]
["HU",2017,"Monetary","EMERGING",{"v":123.146063451278,"d":"123"},"g/kWh"]
["IE",2017,"Monetary","EMERGING",{"v":268.456242802145,"d":"268"},"g/kWh"]
["IT",2017,"Monetary","EMERGING",{"v":147.298303238273,"d":"147"},"g/kWh"]
["LT",2017,"Monetary","EMERGING",{"v":30.4253098442806,"d":"30"},"g/kWh"]
["LU",2017,"Monetary","EMERGING",{"v":556.426893302162,"d":"556"},"g/kWh"]
["LV",2017,"Monetary","EMERGING",{"v":82.3476061137428,"d":"82"},"g/kWh"]
["MT",2017,"Monetary","EMERGING",{"v":261.213352410171,"d":"261"},"g/kWh"]
["NL",2017,"Monetary","EMERGING",{"v":329.745877370118,"d":"330"},"g/kWh"]
["PL",2017,"Monetary","EMERGING",{"v":428.950998384848,"d":"429"},"g/kWh"]
["PT",2017,"Monetary","EMERGING",{"v":457.461313516573,"d":"457"},"g/kWh"]
["RO",2017,"Monetary","EMERGING",{"v":236.84145921577,"d":"237"},"g/kWh"]
["SK",2017,"Monetary","EMERGING",{"v":153.465821819087,"d":"153"},"g/kWh"]
["SI",2017,"Monetary","EMERGING",{"v":252.669243473345,"d":"253"},"g/kWh"]
["SE",2017,"Monetary","EMERGING",{"v":16.2430064156887,"d":"16"},"g/kWh"]
["US",2017,"Monetary","EMERGING",{"v":405.811961948441,"d":"406"},"g/kWh"]
["AT",2017,"Monetary","GTAP 11",{"v":252.46622404648238,"d":"252"},"g/kWh"]
["BE",2017,"Monetary","GTAP 11",{"v":235.62431828515835,"d":"236"},"g/kWh"]
["BG",2017,"Monetary","GTAP 11",{"v":507.905813758151,"d":"508"},"g/kWh"]
["CY",2017,"Monetary","GTAP 11",{"v":170.42295534130977,"d":"170"},"g/kWh"]
["CZ",2017,"Monetary","GTAP 11",{"v":622.2306629048131,"d":"622"},"g/kWh"]
["DE",2017,"Monetary","GTAP 11",{"v":705.1295611996677,"d":"705"},"g/kWh"]
["DK",2017,"Monetary","GTAP 11",{"v":208.34692367448073,"d":"208"},"g/kWh"]
["ES",2017,"Monetary","GTAP 11",{"v":367.2737836517029,"d":"367"},"g/kWh"]
["EE",2017,"Monetary","GTAP 11",{"v":961.0808831365019,"d":"961"},"g/kWh"]
["FI",2017,"Monetary","GTAP 11",{"v":226.87118424033778,"d":"227"},"g/kWh"]
["FR",2017,"Monetary","GTAP 11",{"v":134.6546082713814,"d":"135"},"g/kWh"]
["GR",2017,"Monetary","GTAP 11",{"v":840.2745308314218,"d":"840"},"g/kWh"]
["HR",2017,"Monetary","GTAP 11",{"v":376.695448364876,"d":"377"},"g/kWh"]
["HU",2017,"Monetary","GTAP 11",{"v":318.18812155085095,"d":"318"},"g/kWh"]
["IE",2017,"Monetary","GTAP 11",{"v":637.9176138188226,"d":"638"},"g/kWh"]
["IT",2017,"Monetary","GTAP 11",{"v":392.23986139399807,"d":"392"},"g/kWh"]
["LT",2017,"Monetary","GTAP 11",{"v":93.14276277918063,"d":"93"},"g/kWh"]
["LU",2017,"Monetary","GTAP 11",{"v":242.10805806961764,"d":"242"},"g/kWh"]
["LV",2017,"Monetary","GTAP 11",{"v":200.0742257414539,"d":"200"},"g/kWh"]
["MT",2017,"Monetary","GTAP 11",{"v":641.9924312086956,"d":"642"},"g/kWh"]
["NL",2017,"Monetary","GTAP 11",{"v":516.6777438713905,"d":"517"},"g/kWh"]
["PL",2017,"Monetary","GTAP 11",{"v":865.9936385651044,"d":"866"},"g/kWh"]
["PT",2017,"Monetary","GTAP 11",{"v":566.0028388950841,"d":"566"},"g/kWh"]
["RO",2017,"Monetary","GTAP 11",{"v":451.2765348624789,"d":"451"},"g/kWh"]
["SK",2017,"Monetary","GTAP 11",{"v":350.90863937577825,"d":"351"},"g/kWh"]
["SI",2017,"Monetary","GTAP 11",{"v":433.7343219204215,"d":"434"},"g/kWh"]
["SE",2017,"Monetary","GTAP 11",{"v":38.42580639841121,"d":"38"},"g/kWh"]
["US",2017,"Monetary","GTAP 11",{"v":494.1591179667309,"d":"494"},"g/kWh"]
["AT",2023,"Physical","Electricity Maps",76,"g/kWh"]
["BE",2023,"Physical","Electricity Maps",171,"g/kWh"]
["BG",2023,"Physical","Electricity Maps",412,"g/kWh"]
["CY",2023,"Physical","Electricity Maps",831,"g/kWh"]
["CZ",2023,"Physical","Electricity Maps",506,"g/kWh"]
["DE",2023,"Physical","Electricity Maps",405,"g/kWh"]
["DK",2023,"Physical","Electricity Maps",166,"g/kWh"]
["EE",2023,"Physical","Electricity Maps",572,"g/kWh"]
["ES",2023,"Physical","Electricity Maps",155,"g/kWh"]
["FI",2023,"Physical","Electricity Maps",92,"g/kWh"]
["FR",2023,"Physical","Electricity Maps",42,"g/kWh"]
["GR",2023,"Physical","Electricity Maps",305,"g/kWh"]
["HR",2023,"Physical","Electricity Maps",238,"g/kWh"]
["HU",2023,"Physical","Electricity Maps",246,"g/kWh"]
["IE",2023,"Physical","Electricity Maps",415,"g/kWh"]
["IT",2023,"Physical","Electricity Maps",362,"g/kWh"]
["LT",2023,"Physical","Electricity Maps",127,"g/kWh"]
["LV",2023,"Physical","Electricity Maps",157,"g/kWh"]
["NL",2023,"Physical","Electricity Maps",288,"g/kWh"]
["PL",2023,"Physical","Electricity Maps",777,"g/kWh"]
["PT",2023,"Physical","Electricity Maps",152,"g/kWh"]
["RO",2023,"Physical","Electricity Maps",280,"g/kWh"]
["SE",2023,"Physical","Electricity Maps",21,"g/kWh"]
["SI",2023,"Physical","Electricity Maps",251,"g/kWh"]
["SK",2023,"Physical","Electricity Maps",139,"g/kWh"]
["US",2023,"Physical","Electricity Maps",421,"g/kWh"]
["AT",2023,"Physical","EMBER",{"v":112,"d":"112.000"},"g/kWh"]
["BE",2023,"Physical","EMBER",{"v":135,"d":"135.000"},"g/kWh"]
["BG",2023,"Physical","EMBER",{"v":338,"d":"338.000"},"g/kWh"]
["CY",2023,"Physical","EMBER",{"v":533,"d":"533.000"},"g/kWh"]
["CZ",2023,"Physical","EMBER",443,"g/kWh"]
["DE",2023,"Physical","EMBER",363,"g/kWh"]
["DK",2023,"Physical","EMBER",152,"g/kWh"]
["EE",2023,"Physical","EMBER",395,"g/kWh"]
["ES",2023,"Physical","EMBER",170,"g/kWh"]
["FI",2023,"Physical","EMBER",81.2,"g/kWh"]
["FR",2023,"Physical","EMBER",53.3,"g/kWh"]
["GR",2023,"Physical","EMBER",336,"g/kWh"]
["HR",2023,"Physical","EMBER",195,"g/kWh"]
["HU",2023,"Physical","EMBER",196,"g/kWh"]
["IE",2023,"Physical","EMBER",282,"g/kWh"]
["IT",2023,"Physical","EMBER",323,"g/kWh"]
["LT",2023,"Physical","EMBER",119,"g/kWh"]
["LV",2023,"Physical","EMBER",119,"g/kWh"]
["NL",2023,"Physical","EMBER",268,"g/kWh"]
["PL",2023,"Physical","EMBER",651,"g/kWh"]
["PT",2023,"Physical","EMBER",158,"g/kWh"]
["RO",2023,"Physical","EMBER",243,"g/kWh"]
["SE",2023,"Physical","EMBER",38.4,"g/kWh"]
["SI",2023,"Physical","EMBER",225,"g/kWh"]
["SK",2023,"Physical","EMBER",115,"g/kWh"]
["US",2023,"Physical","EMBER",393,"g/kWh"]
["AT",2023,"Hybrid","EXIO Hybrid",{"v":273.62806176137,"d":"274"},"g/kWh","generation shares from ENTSO-E"]
["AT",2023,"Physical","NREL",{"v":72.5381567452344,"d":"73"},"g/kWh","generation shares from ENTSO-E"]
["AT",2023,"Physical","IPCC",{"v":81.0170509551661,"d":"81"},"g/kWh","generation shares from ENTSO-E"]
["BE",2023,"Hybrid","EXIO Hybrid",{"v":250.158925542331,"d":"250"},"g/kWh","generation shares from ENTSO-E"]
["BE",2023,"Physical","NREL",{"v":125.392651827565,"d":"125"},"g/kWh","generation shares from ENTSO-E"]
["BE",2023,"Physical","IPCC",{"v":124.021350137246,"d":"124"},"g/kWh","generation shares from ENTSO-E"]
["BG",2023,"Hybrid","EXIO Hybrid",{"v":615.064984616681,"d":"615"},"g/kWh","generation shares from ENTSO-E"]
["BG",2023,"Physical","NREL",{"v":371.443265106922,"d":"371"},"g/kWh","generation shares from ENTSO-E"]
["BG",2023,"Physical","IPCC",{"v":316.456032872067,"d":"316"},"g/kWh","generation shares from ENTSO-E"]
["CZ",2023,"Hybrid","EXIO Hybrid",{"v":941.033657439325,"d":"941"},"g/kWh","generation shares from ENTSO-E"]
["CZ",2023,"Physical","NREL",{"v":428.498229964196,"d":"428"},"g/kWh","generation shares from ENTSO-E"]
["CZ",2023,"Physical","IPCC",{"v":365.005967610506,"d":"365"},"g/kWh","generation shares from ENTSO-E"]
["DE",2023,"Hybrid","EXIO Hybrid",{"v":570.279389786437,"d":"570"},"g/kWh","generation shares from ENTSO-E"]
["DE",2023,"Physical","NREL",{"v":359.283552095016,"d":"359"},"g/kWh","generation shares from ENTSO-E"]
["DE",2023,"Physical","IPCC",{"v":314.53325715066,"d":"315"},"g/kWh","generation shares from ENTSO-E"]
["DK",2023,"Hybrid","EXIO Hybrid",{"v":282.308504203666,"d":"282"},"g/kWh","generation shares from ENTSO-E"]
["DK",2023,"Physical","NREL",{"v":181.851305801186,"d":"182"},"g/kWh","generation shares from ENTSO-E"]
["DK",2023,"Physical","IPCC",{"v":163.073907932648,"d":"163"},"g/kWh","generation shares from ENTSO-E"]
["EE",2023,"Hybrid","EXIO Hybrid",{"v":853.892583389604,"d":"854"},"g/kWh","generation shares from ENTSO-E"]
["EE",2023,"Physical","NREL",{"v":522.64212880196,"d":"523"},"g/kWh","generation shares from ENTSO-E"]
["EE",2023,"Physical","IPCC",{"v":504.358393063115,"d":"504"},"g/kWh","generation shares from ENTSO-E"]
["GR",2023,"Hybrid","EXIO Hybrid",{"v":470.117982923781,"d":"470"},"g/kWh","generation shares from ENTSO-E"]
["GR",2023,"Physical","NREL",{"v":297.605295904693,"d":"298"},"g/kWh","generation shares from ENTSO-E"]
["GR",2023,"Physical","IPCC",{"v":279.360775732286,"d":"279"},"g/kWh","generation shares from ENTSO-E"]
["ES",2023,"Hybrid","EXIO Hybrid",{"v":256.018588337569,"d":"256"},"g/kWh","generation shares from ENTSO-E"]
["ES",2023,"Physical","NREL",{"v":141.267723208824,"d":"141"},"g/kWh","generation shares from ENTSO-E"]
["ES",2023,"Physical","IPCC",{"v":137.992177588802,"d":"138"},"g/kWh","generation shares from ENTSO-E"]
["FI",2023,"Hybrid","EXIO Hybrid",{"v":227.223063277924,"d":"227"},"g/kWh","generation shares from ENTSO-E"]
["FI",2023,"Physical","NREL",{"v":81.8745951936603,"d":"82"},"g/kWh","generation shares from ENTSO-E"]
["FI",2023,"Physical","IPCC",{"v":76.4561811750075,"d":"76"},"g/kWh","generation shares from ENTSO-E"]
["FR",2023,"Hybrid","EXIO Hybrid",{"v":137.099994435193,"d":"137"},"g/kWh","generation shares from ENTSO-E"]
["FR",2023,"Physical","NREL",{"v":48.4816500644346,"d":"48"},"g/kWh","generation shares from ENTSO-E"]
["FR",2023,"Physical","IPCC",{"v":48.3793117402483,"d":"48"},"g/kWh","generation shares from ENTSO-E"]
["HR",2023,"Hybrid","EXIO Hybrid",{"v":314.715489682328,"d":"315"},"g/kWh","generation shares from ENTSO-E"]
["HR",2023,"Physical","NREL",{"v":189.759188268169,"d":"190"},"g/kWh","generation shares from ENTSO-E"]
["HR",2023,"Physical","IPCC",{"v":186.131632290255,"d":"186"},"g/kWh","generation shares from ENTSO-E"]
["HU",2023,"Hybrid","EXIO Hybrid",{"v":335.344988369317,"d":"335"},"g/kWh","generation shares from ENTSO-E"]
["HU",2023,"Physical","NREL",{"v":211.645648602126,"d":"212"},"g/kWh","generation shares from ENTSO-E"]
["HU",2023,"Physical","IPCC",{"v":195.520482820605,"d":"196"},"g/kWh","generation shares from ENTSO-E"]
["IE",2023,"Hybrid","EXIO Hybrid",{"v":521.606550054997,"d":"522"},"g/kWh","generation shares from ENTSO-E"]
["IE",2023,"Physical","NREL",{"v":313.122165557157,"d":"313"},"g/kWh","generation shares from ENTSO-E"]
["IE",2023,"Physical","IPCC",{"v":303.067581774199,"d":"303"},"g/kWh","generation shares from ENTSO-E"]
["IT",2023,"Hybrid","EXIO Hybrid",{"v":698.124704129782,"d":"698"},"g/kWh","generation shares from ENTSO-E"]
["IT",2023,"Physical","NREL",{"v":320.815396112822,"d":"321"},"g/kWh","generation shares from ENTSO-E"]
["IT",2023,"Physical","IPCC",{"v":310.139292023355,"d":"310"},"g/kWh","generation shares from ENTSO-E"]
["LT",2023,"Hybrid","EXIO Hybrid",{"v":193.150151266549,"d":"193"},"g/kWh","generation shares from ENTSO-E"]
["LT",2023,"Physical","NREL",{"v":101.620350774504,"d":"102"},"g/kWh","generation shares from ENTSO-E"]
["LT",2023,"Physical","IPCC",{"v":101.539917128757,"d":"102"},"g/kWh","generation shares from ENTSO-E"]
["LV",2023,"Hybrid","EXIO Hybrid",{"v":271.849912924009,"d":"272"},"g/kWh","generation shares from ENTSO-E"]
["LV",2023,"Physical","NREL",{"v":135.746375304411,"d":"136"},"g/kWh","generation shares from ENTSO-E"]
["LV",2023,"Physical","IPCC",{"v":145.545742355988,"d":"146"},"g/kWh","generation shares from ENTSO-E"]
["NL",2023,"Hybrid","EXIO Hybrid",{"v":427.61164928071,"d":"428"},"g/kWh","generation shares from ENTSO-E"]
["NL",2023,"Physical","NREL",{"v":396.041034269499,"d":"396"},"g/kWh","generation shares from ENTSO-E"]
["NL",2023,"Physical","IPCC",{"v":369.895494394396,"d":"370"},"g/kWh","generation shares from ENTSO-E"]
["PL",2023,"Hybrid","EXIO Hybrid",{"v":1359.36758225423,"d":"1359"},"g/kWh","generation shares from ENTSO-E"]
["PL",2023,"Physical","NREL",{"v":684.989640253321,"d":"685"},"g/kWh","generation shares from ENTSO-E"]
["PL",2023,"Physical","IPCC",{"v":582.420324203381,"d":"582"},"g/kWh","generation shares from ENTSO-E"]
["PT",2023,"Hybrid","EXIO Hybrid",{"v":218.322105573008,"d":"218"},"g/kWh","generation shares from ENTSO-E"]
["PT",2023,"Physical","NREL",{"v":135.264740483313,"d":"135"},"g/kWh","generation shares from ENTSO-E"]
["PT",2023,"Physical","IPCC",{"v":138.715667299879,"d":"139"},"g/kWh","generation shares from ENTSO-E"]
["RO",2023,"Hybrid","EXIO Hybrid",{"v":385.312036382449,"d":"385"},"g/kWh","generation shares from ENTSO-E"]
["RO",2023,"Physical","NREL",{"v":234.180405033561,"d":"234"},"g/kWh","generation shares from ENTSO-E"]
["RO",2023,"Physical","IPCC",{"v":215.202753623234,"d":"215"},"g/kWh","generation shares from ENTSO-E"]
["SE",2023,"Hybrid","EXIO Hybrid",{"v":12.6965044299895,"d":"13"},"g/kWh","generation shares from ENTSO-E"]
["SE",2023,"Physical","NREL",{"v":12.2489047497128,"d":"12"},"g/kWh","generation shares from ENTSO-E"]
["SE",2023,"Physical","IPCC",{"v":17.2552505568691,"d":"17"},"g/kWh","generation shares from ENTSO-E"]
["SI",2023,"Hybrid","EXIO Hybrid",{"v":292.256517188104,"d":"292"},"g/kWh","generation shares from ENTSO-E"]
["SI",2023,"Physical","NREL",{"v":223.489498914186,"d":"223"},"g/kWh","generation shares from ENTSO-E"]
["SI",2023,"Physical","IPCC",{"v":195.364065827288,"d":"195"},"g/kWh","generation shares from ENTSO-E"]
["SK",2023,"Hybrid","EXIO Hybrid",{"v":199.824138668413,"d":"200"},"g/kWh","generation shares from ENTSO-E"]
["SK",2023,"Physical","NREL",{"v":99.7096079499649,"d":"100"},"g/kWh","generation shares from ENTSO-E"]
["SK",2023,"Physical","IPCC",{"v":95.935674158851,"d":"96"},"g/kWh","generation shares from ENTSO-E"]
["US",2023,"Hybrid","EXIO Hybrid",{"v":643.929466864971,"d":"644"},"g/kWh","generation shares from ENTSO-E"]
["US",2023,"Physical","NREL",{"v":385.614956393199,"d":"386"},"g/kWh","generation shares from ENTSO-E"]
["US",2023,"Physical","IPCC",{"v":359.519611010563,"d":"360"},"g/kWh","generation shares from ENTSO-E"]
["AT",2023,"Monetary","GLORIA com",{"v":292.8281075113664,"d":"292.8"},"g/kWh"]
["BE",2023,"Monetary","GLORIA com",{"v":191.24348956627716,"d":"191.2"},"g/kWh"]
["BG",2023,"Monetary","GLORIA com",{"v":472.23371815096874,"d":"472.2"},"g/kWh"]
["CY",2023,"Monetary","GLORIA com",{"v":1341.3337729155623,"d":"1341.3"},"g/kWh"]
["CZ",2023,"Monetary","GLORIA com",{"v":597.6068712620107,"d":"597.6"},"g/kWh"]
["DE",2023,"Monetary","GLORIA com",{"v":224.00887223549003,"d":"224.0"},"g/kWh"]
["DK",2023,"Monetary","GLORIA com",{"v":138.8714435181104,"d":"138.9"},"g/kWh"]
["ES",2023,"Monetary","GLORIA com",{"v":242.24652900767714,"d":"242.2"},"g/kWh"]
["EE",2023,"Monetary","GLORIA com",{"v":435.40441389266516,"d":"435.4"},"g/kWh"]
["FI",2023,"Monetary","GLORIA com",{"v":136.6393782030821,"d":"136.6"},"g/kWh"]
["FR",2023,"Monetary","GLORIA com",{"v":89.34387843149999,"d":"89.3"},"g/kWh"]
["GR",2023,"Monetary","GLORIA com",{"v":463.6218560654034,"d":"463.6"},"g/kWh"]
["HR",2023,"Monetary","GLORIA com",{"v":256.5169651782874,"d":"256.5"},"g/kWh"]
["HU",2023,"Monetary","GLORIA com",{"v":308.2452890434503,"d":"308.2"},"g/kWh"]
["IE",2023,"Monetary","GLORIA com",{"v":499.61069200358423,"d":"499.6"},"g/kWh"]
["IT",2023,"Monetary","GLORIA com",{"v":382.8637095417516,"d":"382.9"},"g/kWh"]
["LT",2023,"Monetary","GLORIA com",{"v":99.62018378875842,"d":"99.6"},"g/kWh"]
["LU",2023,"Monetary","GLORIA com",{"v":48.97364121067625,"d":"49.0"},"g/kWh"]
["LV",2023,"Monetary","GLORIA com",{"v":121.37049496162521,"d":"121.4"},"g/kWh"]
["MT",2023,"Monetary","GLORIA com",{"v":328.02820638534087,"d":"328.0"},"g/kWh"]
["NL",2023,"Monetary","GLORIA com",{"v":402.2582026858159,"d":"402.3"},"g/kWh"]
["PL",2023,"Monetary","GLORIA com",{"v":797.0599003026398,"d":"797.1"},"g/kWh"]
["PT",2023,"Monetary","GLORIA com",{"v":308.53414276806143,"d":"308.5"},"g/kWh"]
["RO",2023,"Monetary","GLORIA com",{"v":125.42747531380724,"d":"125.4"},"g/kWh"]
["SK",2023,"Monetary","GLORIA com",{"v":312.5151160537938,"d":"312.5"},"g/kWh"]
["SI",2023,"Monetary","GLORIA com",{"v":259.3425863115111,"d":"259.3"},"g/kWh"]
["SE",2023,"Monetary","GLORIA com",{"v":37.75014834258814,"d":"37.8"},"g/kWh"]
["US",2023,"Monetary","GLORIA com",{"v":649.6860320752049,"d":"649.7"},"g/kWh"]
["AT",2023,"Monetary","GLORIA act",{"v":292.82216295494715,"d":"292.8"},"g/kWh"]
["BE",2023,"Monetary","GLORIA act",{"v":191.2455374873297,"d":"191.2"},"g/kWh"]
["BG",2023,"Monetary","GLORIA act",{"v":472.23498047334544,"d":"472.2"},"g/kWh"]
["CY",2023,"Monetary","GLORIA act",{"v":1341.3276480571838,"d":"1341.3"},"g/kWh"]
["CZ",2023,"Monetary","GLORIA act",{"v":597.6123848067487,"d":"597.6"},"g/kWh"]
["DE",2023,"Monetary","GLORIA act",{"v":224.0044970259183,"d":"224.0"},"g/kWh"]
["DK",2023,"Monetary","GLORIA act",{"v":138.8725459271194,"d":"138.9"},"g/kWh"]
["ES",2023,"Monetary","GLORIA act",{"v":242.2468793756992,"d":"242.2"},"g/kWh"]
["EE",2023,"Monetary","GLORIA act",{"v":435.41168128841525,"d":"435.4"},"g/kWh"]
["FI",2023,"Monetary","GLORIA act",{"v":136.6425701657443,"d":"136.6"},"g/kWh"]
["FR",2023,"Monetary","GLORIA act",{"v":89.34293002427532,"d":"89.3"},"g/kWh"]
["GR",2023,"Monetary","GLORIA act",{"v":463.6316537095589,"d":"463.6"},"g/kWh"]
["HR",2023,"Monetary","GLORIA act",{"v":256.51723692029856,"d":"256.5"},"g/kWh"]
["HU",2023,"Monetary","GLORIA act",{"v":308.2463209454943,"d":"308.2"},"g/kWh"]
["IE",2023,"Monetary","GLORIA act",{"v":499.6093750605482,"d":"499.6"},"g/kWh"]
["IT",2023,"Monetary","GLORIA act",{"v":382.8625503351941,"d":"382.9"},"g/kWh"]
["LT",2023,"Monetary","GLORIA act",{"v":99.62114463158568,"d":"99.6"},"g/kWh"]
["LU",2023,"Monetary","GLORIA act",{"v":48.97396700923062,"d":"49.0"},"g/kWh"]
["LV",2023,"Monetary","GLORIA act",{"v":121.37129508184377,"d":"121.4"},"g/kWh"]
["MT",2023,"Monetary","GLORIA act",{"v":328.03321029708013,"d":"328.0"},"g/kWh"]
["NL",2023,"Monetary","GLORIA act",{"v":402.2587248235954,"d":"402.3"},"g/kWh"]
["PL",2023,"Monetary","GLORIA act",{"v":797.0628798415224,"d":"797.1"},"g/kWh"]
["PT",2023,"Monetary","GLORIA act",{"v":308.54373167927287,"d":"308.5"},"g/kWh"]
["RO",2023,"Monetary","GLORIA act",{"v":125.42758677186896,"d":"125.4"},"g/kWh"]
["SK",2023,"Monetary","GLORIA act",{"v":312.52807290929724,"d":"312.5"},"g/kWh"]
["SI",2023,"Monetary","GLORIA act",{"v":259.34666533592355,"d":"259.3"},"g/kWh"]
["SE",2023,"Monetary","GLORIA act",{"v":37.74949641590559,"d":"37.7"},"g/kWh"]
["US",2023,"Monetary","GLORIA act",{"v":649.6954617502313,"d":"649.7"},"g/kWh"]
["AT",2023,"Monetary","EMERGING",448.12948866675,"g/kWh"]
["BE",2023,"Monetary","EMERGING",246.935554001515,"g/kWh"]
["BG",2023,"Monetary","EMERGING",285.670410104918,"g/kWh"]
["CY",2023,"Monetary","EMERGING",316.484101334841,"g/kWh"]
["CZ",2023,"Monetary","EMERGING",1122.94672172329,"g/kWh"]
["DE",2023,"Monetary","EMERGING",250.933290558624,"g/kWh"]
["DK",2023,"Monetary","EMERGING",202.015326674249,"g/kWh"]
["ES",2023,"Monetary","EMERGING",162.02855852245,"g/kWh"]
["EE",2023,"Monetary","EMERGING",425.772861930973,"g/kWh"]
["FI",2023,"Monetary","EMERGING",96.2478436553363,"g/kWh"]
["FR",2023,"Monetary","EMERGING",138.867696204982,"g/kWh"]
["GR",2023,"Monetary","EMERGING",725.504092297745,"g/kWh"]
["HR",2023,"Monetary","EMERGING",263.333071183856,"g/kWh"]
["HU",2023,"Monetary","EMERGING",413.52287529585,"g/kWh"]
["IE",2023,"Monetary","EMERGING",423.828762666881,"g/kWh"]
["IT",2023,"Monetary","EMERGING",330.662359467271,"g/kWh"]
["LT",2023,"Monetary","EMERGING",134.607361325217,"g/kWh"]
["LU",2023,"Monetary","EMERGING",405.71621537847,"g/kWh"]
["LV",2023,"Monetary","EMERGING",514.184986705625,"g/kWh"]
["MT",2023,"Monetary","EMERGING",478.712207946461,"g/kWh"]
["NL",2023,"Monetary","EMERGING",275.900512885812,"g/kWh"]
["PL",2023,"Monetary","EMERGING",837.013177837507,"g/kWh"]
["PT",2023,"Monetary","EMERGING",228.554710586902,"g/kWh"]
["RO",2023,"Monetary","EMERGING",1083.7800292537,"g/kWh"]
["SK",2023,"Monetary","EMERGING",511.734308536139,"g/kWh"]
["SI",2023,"Monetary","EMERGING",522.049101758678,"g/kWh"]
["SE",2023,"Monetary","EMERGING",23.1640561597408,"g/kWh"]
["US",2023,"Monetary","EMERGING",643.670115394854,"g/kWh"]

{"sheet":"Stat analysis DCI 2017","index":7,"n_rows":30,"n_cols":22,"rows_kept":30,"merged":[[0,10,0,19],[0,20,0,21]]}
[null,"Physical","Physical","Hybrid","Monetary","Monetary","Monetary","Monetary","Monetary","Monetary","Stats",{"$nulls":9},"Sources comparison"]
["Paese","Electricity Maps","JRC","EXIO Hybrid","EORA 199.82","EXIOBASE 3.10 ixi","EXIOBASE 3.10 pxp","GLORIA 0.6 act","GTAP 11","EMERGING 1","Median","Mean","Standard dev","CV%","Min","Max","Relative \ndispersion%","Q1","Q2","IQR","Source min","Source max"]
["AT",{"v":90.4851354012873,"d":"90.5"},{"v":315.531034200812,"d":"315.5"},{"v":154.308800429182,"d":"154.3"},{"v":47.7123745145757,"d":"47.7"},{"v":24.8676990281184,"d":"24.9"},{"v":18.7475724415882,"d":"18.7"},{"v":54.6250936635903,"d":"54.6"},{"v":198.515256247341,"d":"198.5"},{"v":24.2727115600944,"d":"24.3"},{"$f":"MEDIAN(B3:J3)","v":{"v":54.6250936635903,"d":"54.6"}},{"$f":"AVERAGE(B3:J3)","v":{"v":103.22951972073214,"d":"103.2"}},{"$f":"_xlfn.STDEV.S(B3:J3)","v":{"v":101.16775205244937,"d":"101.2"}},{"$f":"M3/L3","v":{"v":0.9800273441757698,"d":"1.0"}},{"$f":"MIN(B3:J3)","v":{"v":18.7475724415882,"d":"18.7"}},{"$f":"MAX(B3:J3)","v":{"v":315.531034200812,"d":"315.5"}},{"$f":"(P3-O3)/K3","v":{"v":5.4330975354837925,"d":"543%"}},{"$f":"QUARTILE(B3:J3,1)","v":{"v":24.8676990281184,"d":"24.9"}},{"$f":"QUARTILE(B3:J3,3)","v":{"v":154.308800429182,"d":"154.3"}},{"$f":"QUARTILE(B3:J3,3)-QUARTILE(B3:I3,1)","v":{"v":112.30759478622065,"d":"112.3"}},{"$f":"INDEX($B$2:$J$2,MATCH(O3,B3:J3,0))","v":"EXIOBASE 3.10 pxp"},{"$f":"INDEX($B$2:$J$2,MATCH(P3,B3:J3,0))","v":"JRC"}]
["BE",{"v":141.314889698449,"d":"141.3"},{"v":217.128376783737,"d":"217.1"},{"v":185.213931629819,"d":"185.2"},{"v":159.507588635767,"d":"159.5"},{"v":120.054415132635,"d":"120.1"},{"v":103.125201265044,"d":"103.1"},{"v":140.960598870637,"d":"141.0"},{"v":188.047078175302,"d":"188.0"},{"v":20.4200307981398,"d":"20.4"},{"$f":"MEDIAN(B4:J4)","v":{"v":141.314889698449,"d":"141.3"}},{"$f":"AVERAGE(B4:J4)","v":{"v":141.75245677661442,"d":"141.8"}},{"$f":"_xlfn.STDEV.S(B4:J4)","v":{"v":57.786364923280956,"d":"57.8"}},{"$f":"M4/L4","v":{"v":0.4076568846658201,"d":"0.4"}},{"$f":"MIN(B4:J4)","v":{"v":20.4200307981398,"d":"20.4"}},{"$f":"MAX(B4:J4)","v":{"v":217.128376783737,"d":"217.1"}},{"$f":"(P4-O4)/K4","v":{"v":1.391985985378837,"d":"139%"}},{"$f":"QUARTILE(B4:J4,1)","v":{"v":120.054415132635,"d":"120.1"}},{"$f":"QUARTILE(B4:J4,3)","v":{"v":185.213931629819,"d":"185.2"}},{"$f":"QUARTILE(B4:J4,3)-QUARTILE(B4:I4,1)","v":{"v":49.47987869368251,"d":"49.5"}},"EMERGING 1","JRC"]
["BG",{"v":545.012194430927,"d":"545.0"},{"v":658.42801915841,"d":"658.4"},{"v":542.045782200647,"d":"542.0"},{"v":217.288361785935,"d":"217.3"},{"v":379.965205810826,"d":"380.0"},{"v":407.8823770168,"d":"407.9"},{"v":597.028477202797,"d":"597.0"},{"v":403.521627936209,"d":"403.5"},{"v":482.600423513271,"d":"482.6"},{"v":482.600423513271,"d":"482.6"},{"v":470.41916322842474,"d":"470.4"},{"v":133.6335358143365,"d":"133.6"},{"v":0.2840733249411592,"d":"0.3"},{"v":217.288361785935,"d":"217.3"},{"v":658.42801915841,"d":"658.4"},{"v":0.914088831835317,"d":"91%"},{"v":403.521627936209,"d":"403.5"},{"v":545.012194430927,"d":"545.0"},{"v":147.37967202606382,"d":"147.4"},"EORA 199.82","JRC"]
["CY",null,{"v":722.279491964097,"d":"722.3"},null,{"v":454.296189354355,"d":"454.3"},{"v":441.622367376683,"d":"441.6"},{"v":442.8285894779,"d":"442.8"},{"v":497.205335078337,"d":"497.2"},{"v":117.120823501161,"d":"117.1"},{"v":260.573449773239,"d":"260.6"},{"v":442.8285894779,"d":"442.8"},{"v":419.4180352179675,"d":"419.4"},{"v":190.02136046251522,"d":"190.0"},{"v":0.45305958377245975,"d":"0.5"},{"v":117.120823501161,"d":"117.1"},{"v":722.279491964097,"d":"722.3"},{"v":1.36657542634369,"d":"137%"},{"v":351.097908574961,"d":"351.1"},{"v":475.750762216346,"d":"475.8"},{"v":33.82683931435878,"d":"33.8"},"GTAP 11","JRC"]
["CZ",{"v":553.200289906823,"d":"553.2"},{"v":659.618779950752,"d":"659.6"},{"v":558.408398547125,"d":"558.4"},{"v":165.322984353841,"d":"165.3"},{"v":249.896982872873,"d":"249.9"},{"v":253.699577888814,"d":"253.7"},{"v":333.155930706415,"d":"333.2"},{"v":528.34790778211,"d":"528.3"},{"v":167.745512356175,"d":"167.7"},{"v":333.155930706415,"d":"333.2"},{"v":385.4884849294364,"d":"385.5"},{"v":189.72404197602353,"d":"189.7"},{"v":0.49216526405646716,"d":"0.5"},{"v":165.322984353841,"d":"165.3"},{"v":659.618779950752,"d":"659.6"},{"v":1.4836770113886892,"d":"148%"},{"v":249.896982872873,"d":"249.9"},{"v":553.200289906823,"d":"553.2"},{"v":300.4513607719942,"d":"300.5"},"EORA 199.82","JRC"]
["DE",{"v":448.702731277532,"d":"448.7"},{"v":474.827287854926,"d":"474.8"},{"v":454.99095254016,"d":"455.0"},{"v":141.561142562015,"d":"141.6"},{"v":171.672964542431,"d":"171.7"},{"v":151.614803399639,"d":"151.6"},{"v":217.133444950494,"d":"217.1"},{"v":630.868978140081,"d":"630.9"},{"v":285.340529887491,"d":"285.3"},{"v":285.340529887491,"d":"285.3"},{"v":330.74587057275204,"d":"330.7"},{"v":176.18754711700308,"d":"176.2"},{"v":0.5326976473263276,"d":"0.5"},{"v":141.561142562015,"d":"141.6"},{"v":630.868978140081,"d":"630.9"},{"v":1.714820659269816,"d":"171%"},{"v":171.672964542431,"d":"171.7"},{"v":454.99095254016,"d":"455.0"},{"v":288.332528283427,"d":"288.3"},"EORA 199.82","GTAP 11"]
["DK",{"v":173.256950607895,"d":"173.3"},{"v":140.558131432961,"d":"140.6"},{"v":229.581836290414,"d":"229.6"},{"v":163.338689638688,"d":"163.3"},{"v":11.156234106957,"d":"11.2"},{"v":6.8132106821033,"d":"6.8"},{"v":127.202384948531,"d":"127.2"},{"v":174.412490573384,"d":"174.4"},{"v":47.5627596774052,"d":"47.6"},{"v":140.558131432961,"d":"140.6"},{"v":119.3202986620376,"d":"119.3"},{"v":79.10370123296784,"d":"79.1"},{"v":0.6629525916375795,"d":"0.7"},{"v":6.8132106821033,"d":"6.8"},{"v":229.581836290414,"d":"229.6"},{"v":1.5848860776479508,"d":"158%"},{"v":47.5627596774052,"d":"47.6"},{"v":173.256950607895,"d":"173.3"},{"v":75.06610336975749,"d":"75.1"},"EXIOBASE 3.10 pxp","EXIO Hybrid"]
["EE",{"v":574.274610065271,"d":"574.3"},{"v":1032.46527781311,"d":"1,032.5"},{"v":544.219733492155,"d":"544.2"},{"v":351.576730052992,"d":"351.6"},{"v":266.076275142821,"d":"266.1"},{"v":238.383914536536,"d":"238.4"},{"v":450.157711597987,"d":"450.2"},{"v":211.540912333105,"d":"211.5"},{"v":555.075951483126,"d":"555.1"},{"v":450.157711597987,"d":"450.2"},{"v":469.3079018352337,"d":"469.3"},{"v":254.07487633762653,"d":"254.1"},{"v":0.5413820550305332,"d":"0.5"},{"v":211.540912333105,"d":"211.5"},{"v":1032.46527781311,"d":"1032.5"},{"v":1.8236372371937306,"d":"182%"},{"v":266.076275142821,"d":"266.1"},{"v":555.075951483126,"d":"555.1"},{"v":295.92276649187625,"d":"295.9"},"GTAP 11","JRC"]
["ES",{"v":314.68529363203,"d":"314.7"},{"v":338.129908816881,"d":"338.1"},{"v":299.238891463561,"d":"299.2"},{"v":172.576571390296,"d":"172.6"},{"v":232.698126393914,"d":"232.7"},{"v":189.775448644112,"d":"189.8"},{"v":174.398809560829,"d":"174.4"},{"v":289.996545737176,"d":"290.0"},{"v":58.1285073214421,"d":"58.1"},{"v":232.698126393914,"d":"232.7"},{"v":229.95867810669344,"d":"230.0"},{"v":90.0078588980002,"d":"90.0"},{"v":0.39140883761838047,"d":"0.4"},{"v":58.1285073214421,"d":"58.1"},{"v":338.129908816881,"d":"338.1"},{"v":1.2032817188284937,"d":"120%"},{"v":174.398809560829,"d":"174.4"},{"v":299.238891463561,"d":"299.2"},{"v":113.30760259026977,"d":"113.3"},"EMERGING 1","JRC"]
["FI",{"v":155.889545402563,"d":"155.9"},{"v":98.4943316320439,"d":"98.5"},{"v":246.012961154905,"d":"246.0"},{"v":189.9217059101,"d":"189.9"},{"v":60.2132623498916,"d":"60.2"},{"v":51.8163762876683,"d":"51.8"},{"v":128.648250458217,"d":"128.6"},{"v":187.84849540838,"d":"187.8"},{"v":115.291293988965,"d":"115.3"},{"v":128.648250458217,"d":"128.6"},{"v":137.12624695474818,"d":"137.1"},{"v":64.03410476420083,"d":"64.0"},{"v":0.46697190498717694,"d":"0.5"},{"v":51.8163762876683,"d":"51.8"},{"v":246.012961154905,"d":"246.0"},{"v":1.509515941146116,"d":"151%"},{"v":98.4943316320439,"d":"98.5"},{"v":187.84849540838,"d":"187.8"},{"v":98.92443109687417,"d":"98.9"},"EXIOBASE 3.10 pxp","EXIO Hybrid"]
["FR",{"v":51.0338344531707,"d":"51.0"},{"v":87.2296972628698,"d":"87.2"},{"v":71.5099287847903,"d":"71.5"},{"v":39.95075417577,"d":"40.0"},{"v":37.806615732441,"d":"37.8"},{"v":37.7949331149978,"d":"37.8"},{"v":40.571284603703,"d":"40.6"},{"v":103.06303413907,"d":"103.1"},{"v":25.0300163085229,"d":"25.0"},{"v":40.571284603703,"d":"40.6"},{"v":54.88778873059283,"d":"54.9"},{"v":26.366403506723046,"d":"26.4"},{"v":0.480369206275333,"d":"0.5"},{"v":25.0300163085229,"d":"25.0"},{"v":103.06303413907,"d":"103.1"},{"v":1.9233558560634019,"d":"192%"},{"v":37.806615732441,"d":"37.8"},{"v":71.5099287847903,"d":"71.5"},{"v":32.09520921985255,"d":"32.1"},"EMERGING 1","GTAP 11"]
["GR",{"v":604.554543084119,"d":"604.6"},{"v":615.218131264069,"d":"615.2"},{"v":599.792428776566,"d":"599.8"},{"v":492.560196406927,"d":"492.6"},{"v":176.700178860703,"d":"176.7"},{"v":175.327308588371,"d":"175.3"},{"v":251.467308123654,"d":"251.5"},{"v":706.279895746352,"d":"706.3"},{"v":247.684133111494,"d":"247.7"},{"v":492.560196406927,"d":"492.6"},{"v":429.9537915513617,"d":"430.0"},{"v":214.47051948029213,"d":"214.5"},{"v":0.4988222541460523,"d":"0.5"},{"v":175.327308588371,"d":"175.3"},{"v":706.279895746352,"d":"706.3"},{"v":1.0779445660268827,"d":"108%"},{"v":247.684133111494,"d":"247.7"},{"v":604.554543084119,"d":"604.6"},{"v":371.7790172762028,"d":"371.8"},"EXIOBASE 3.10 pxp","GTAP 11"]
["HR",{"v":229.137155963302,"d":"229.1"},{"v":418.883203724843,"d":"418.9"},{"v":270.18885480849,"d":"270.2"},{"v":120.421688268095,"d":"120.4"},{"v":140.488175312077,"d":"140.5"},{"v":113.719211523646,"d":"113.7"},{"v":99.9135361441383,"d":"99.9"},{"v":302.974747848672,"d":"303.0"},{"v":59.4284827361543,"d":"59.4"},{"v":140.488175312077,"d":"140.5"},{"v":195.0172284810464,"d":"195.0"},{"v":117.87813824302458,"d":"117.9"},{"v":0.6044498691790253,"d":"0.6"},{"v":59.4284827361543,"d":"59.4"},{"v":418.883203724843,"d":"418.9"},{"v":2.558611927233055,"d":"256%"},{"v":113.719211523646,"d":"113.7"},{"v":270.18885480849,"d":"270.2"},{"v":151.44278572650728,"d":"151.4"},"EMERGING 1","JRC"]
["HU",{"v":320.611529846787,"d":"320.6"},{"v":282.302921903931,"d":"282.3"},{"v":317.412148063025,"d":"317.4"},{"v":113.955923539693,"d":"114.0"},{"v":126.90957135676,"d":"126.9"},{"v":132.035348019737,"d":"132.0"},{"v":197.18111406619,"d":"197.2"},{"v":265.832408375797,"d":"265.8"},{"v":82.9615957119342,"d":"83.0"},{"v":197.18111406619,"d":"197.2"},{"v":204.35584009820602,"d":"204.4"},{"v":93.76872644487516,"d":"93.8"},{"v":0.4588502408338969,"d":"0.5"},{"v":82.9615957119342,"d":"83.0"},{"v":320.611529846787,"d":"320.6"},{"v":1.205236795929037,"d":"121%"},{"v":126.90957135676,"d":"126.9"},{"v":282.302921903931,"d":"282.3"},{"v":151.54901804993827,"d":"151.5"},"EMERGING 1","Electricity Maps"]
["IE",{"v":505.248267484473,"d":"505.2"},{"v":422.844473630696,"d":"422.8"},{"v":453.891160323552,"d":"453.9"},{"v":277.487291521651,"d":"277.5"},{"v":318.413011415811,"d":"318.4"},{"v":304.7048766265,"d":"304.7"},{"v":310.203432416414,"d":"310.2"},{"v":582.57225319719,"d":"582.6"},{"v":205.538038920898,"d":"205.5"},{"v":318.413011415811,"d":"318.4"},{"v":375.6558672819095,"d":"375.7"},{"v":122.0287160069975,"d":"122.0"},{"v":0.3248417677858909,"d":"0.3"},{"v":205.538038920898,"d":"205.5"},{"v":582.57225319719,"d":"582.6"},{"v":1.184104294607259,"d":"118%"},{"v":304.7048766265,"d":"304.7"},{"v":453.891160323552,"d":"453.9"},{"v":145.06236685461653,"d":"145.1"},"EMERGING 1","GTAP 11"]
["IT",{"v":384.552422808706,"d":"384.6"},{"v":327.670215918589,"d":"327.7"},{"v":345.19267276119,"d":"345.2"},{"v":170.169721618575,"d":"170.2"},{"v":189.689177064169,"d":"189.7"},{"v":175.588548357472,"d":"175.6"},{"v":151.117535794942,"d":"151.1"},{"v":315.836631241161,"d":"315.8"},{"v":85.2660374929357,"d":"85.3"},{"v":189.689177064169,"d":"189.7"},{"v":238.34255145085996,"d":"238.3"},{"v":105.34017034161204,"d":"105.3"},{"v":0.44196963446256654,"d":"0.4"},{"v":85.2660374929357,"d":"85.3"},{"v":384.552422808706,"d":"384.6"},{"v":1.5777725959268947,"d":"158%"},{"v":170.169721618575,"d":"170.2"},{"v":327.670215918589,"d":"327.7"},{"v":153.43637424584125,"d":"153.4"},"EMERGING 1","Electricity Maps"]
["LT",{"v":104.416771067549,"d":"104.4"},{"v":70.6745925198884,"d":"70.7"},{"v":120.289488206423,"d":"120.3"},{"v":93.4894776605522,"d":"93.5"},{"v":14.3544379918326,"d":"14.4"},{"v":8.13438803657784,"d":"8.1"},{"v":57.6241390149396,"d":"57.6"},{"v":64.0430834888302,"d":"64.0"},{"v":5.7916042070239,"d":"5.8"},{"v":64.0430834888302,"d":"64.0"},{"v":59.86866468817963,"d":"59.9"},{"v":42.68651600384519,"d":"42.7"},{"v":0.7130026404659924,"d":"0.7"},{"v":5.7916042070239,"d":"5.8"},{"v":120.289488206423,"d":"120.3"},{"v":1.78782590971543,"d":"179%"},{"v":14.3544379918326,"d":"14.4"},{"v":93.4894776605522,"d":"93.5"},{"v":46.68276390138935,"d":"46.7"},"EMERGING 1","EXIO Hybrid"]
["LU",null,{"v":437.211310590705,"d":"437.2"},null,{"v":62.3539796571069,"d":"62.4"},{"v":13.3492746211635,"d":"13.3"},{"v":1.50968118214459,"d":"1.5"},{"v":14.0904965382462,"d":"14.1"},{"v":172.775966691845,"d":"172.8"},{"v":307.063869700749,"d":"307.1"},{"v":62.3539796571069,"d":"62.4"},{"v":144.05065414028005,"d":"144.1"},{"v":170.44373034553084,"d":"170.4"},{"v":1.1832208007854554,"d":"1.2"},{"v":1.50968118214459,"d":"1.5"},{"v":437.211310590705,"d":"437.2"},{"v":6.987551264643308,"d":"699%"},{"v":13.719885579704851,"d":"13.7"},{"v":239.91991819629703,"d":"239.9"},{"v":226.38533809586286,"d":"226.4"},"EXIOBASE 3.10 pxp","JRC"]
["LV",{"v":134.804726068377,"d":"134.8"},{"v":370.21389755293,"d":"370.2"},{"v":144.456041456347,"d":"144.5"},{"v":113.061777118981,"d":"113.1"},{"v":26.1844526962732,"d":"26.2"},{"v":13.0958852569277,"d":"13.1"},{"v":62.3172234486623,"d":"62.3"},{"v":148.876691575182,"d":"148.9"},{"v":36.4377533884126,"d":"36.4"},{"v":113.061777118981,"d":"113.1"},{"v":116.60538317356587,"d":"116.6"},{"v":108.82460790369149,"d":"108.8"},{"v":0.9332725894970665,"d":"0.9"},{"v":13.0958852569277,"d":"13.1"},{"v":370.21389755293,"d":"370.2"},{"v":3.1586095796122837,"d":"316%"},{"v":36.4377533884126,"d":"36.4"},{"v":144.456041456347,"d":"144.5"},{"v":91.17201069578199,"d":"91.2"},"EXIOBASE 3.10 pxp","JRC"]
["MT",null,{"v":423.599179161041,"d":"423.6"},null,{"v":430.805938645811,"d":"430.8"},{"v":83.0253782962644,"d":"83.0"},{"v":52.2290016511912,"d":"52.2"},{"v":82.195681038864,"d":"82.2"},{"v":518.856614102197,"d":"518.9"},{"v":216.758143886298,"d":"216.8"},{"v":216.758143886298,"d":"216.8"},{"v":258.2099909688095,"d":"258.2"},{"v":196.17029858450667,"d":"196.2"},{"v":0.7597316348932566,"d":"0.8"},{"v":52.2290016511912,"d":"52.2"},{"v":518.856614102197,"d":"518.9"},{"v":2.1527570041187407,"d":"215%"},{"v":82.61052966756421,"d":"82.6"},{"v":427.202558903426,"d":"427.2"},{"v":344.79945355021187,"d":"344.8"},"EXIOBASE 3.10 pxp","GTAP 11"]
["NL",{"v":527.982015420876,"d":"528.0"},{"v":466.041708142696,"d":"466.0"},{"v":395.234889340344,"d":"395.2"},{"v":131.930754450807,"d":"131.9"},{"v":220.721895606876,"d":"220.7"},{"v":196.319581353431,"d":"196.3"},{"v":239.177775641281,"d":"239.2"},{"v":444.740195983176,"d":"444.7"},{"v":239.577353628986,"d":"239.6"},{"v":239.577353628986,"d":"239.6"},{"v":317.96957439649697,"d":"318.0"},{"v":141.10769989625499,"d":"141.1"},{"v":0.44377736506417625,"d":"0.4"},{"v":131.930754450807,"d":"131.9"},{"v":527.982015420876,"d":"528.0"},{"v":1.6531247840035892,"d":"165%"},{"v":220.721895606876,"d":"220.7"},{"v":444.740195983176,"d":"444.7"},{"v":230.11887893966127,"d":"230.1"},"EORA 199.82","Electricity Maps"]
["PL",{"v":916.434430744539,"d":"916.4"},{"v":867.557853085136,"d":"867.6"},{"v":760.243199010558,"d":"760.2"},{"v":279.232205151918,"d":"279.2"},{"v":427.726426390042,"d":"427.7"},{"v":372.211859144435,"d":"372.2"},{"v":551.56644623107,"d":"551.6"},{"v":726.977620619013,"d":"727.0"},{"v":352.804924629696,"d":"352.8"},{"v":551.56644623107,"d":"551.6"},{"v":583.8616627784896,"d":"583.9"},{"v":239.55269598497912,"d":"239.6"},{"v":0.4102901616197785,"d":"0.4"},{"v":279.232205151918,"d":"279.2"},{"v":916.434430744539,"d":"916.4"},{"v":1.1552592256956749,"d":"116%"},{"v":372.211859144435,"d":"372.2"},{"v":760.243199010558,"d":"760.2"},{"v":346.39541443191774,"d":"346.4"},"EORA 199.82","Electricity Maps"]
["PT",{"v":393.2200459742,"d":"393.2"},{"v":423.487234442501,"d":"423.5"},{"v":398.855653628542,"d":"398.9"},{"v":159.877336670005,"d":"159.9"},{"v":168.877506093332,"d":"168.9"},{"v":139.956236461886,"d":"140.0"},{"v":149.692957105494,"d":"149.7"},{"v":481.551182138954,"d":"481.6"},{"v":252.396166320387,"d":"252.4"},{"v":252.396166320387,"d":"252.4"},{"v":285.3238132039223,"d":"285.3"},{"v":137.85573957099734,"d":"137.9"},{"v":0.483155394647944,"d":"0.5"},{"v":139.956236461886,"d":"140.0"},{"v":481.551182138954,"d":"481.6"},{"v":1.3534078217473944,"d":"135%"},{"v":159.877336670005,"d":"159.9"},{"v":398.855653628542,"d":"398.9"},{"v":241.52441184966472,"d":"241.5"},"EXIOBASE 3.10 pxp","GTAP 11"]
["RO",{"v":430.136005158907,"d":"430.1"},{"v":471.221534694691,"d":"471.2"},{"v":400.543036350995,"d":"400.5"},{"v":120.636762085524,"d":"120.6"},{"v":291.774722661721,"d":"291.8"},{"v":291.760880994755,"d":"291.8"},{"v":223.129188150283,"d":"223.1"},{"v":369.798498155284,"d":"369.8"},{"v":127.096003075253,"d":"127.1"},{"v":291.774722661721,"d":"291.8"},{"v":302.8996257030459,"d":"302.9"},{"v":127.11652089411986,"d":"127.1"},{"v":0.4196654934751925,"d":"0.4"},{"v":120.636762085524,"d":"120.6"},{"v":471.221534694691,"d":"471.2"},{"v":1.201559783558185,"d":"120%"},{"v":223.129188150283,"d":"223.1"},{"v":400.543036350995,"d":"400.5"},{"v":125.940078567358,"d":"125.9"},"EORA 199.82","JRC"]
["SE",{"v":1.52382168863012,"d":"1.5"},{"v":17.0470352100545,"d":"17.0"},{"v":0.0181887536716836,"d":"0.0"},{"v":37.5882011175551,"d":"37.6"},{"v":1.69457576867181,"d":"1.7"},{"v":0.922205178177092,"d":"0.9"},{"v":36.3745240377098,"d":"36.4"},{"v":28.6008843005413,"d":"28.6"},{"v":7.22630804307561,"d":"7.2"},{"v":7.22630804307561,"d":"7.2"},{"v":14.555082677565224,"d":"14.6"},{"v":15.796363938506538,"d":"15.8"},{"v":1.0852816358683135,"d":"1.1"},{"v":0.0181887536716836,"d":"0.0"},{"v":37.5882011175551,"d":"37.6"},{"v":5.199060452437222,"d":"520%"},{"v":1.52382168863012,"d":"1.5"},{"v":28.6008843005413,"d":"28.6"},{"v":27.227466739524438,"d":"27.2"},"EXIO Hybrid","EORA 199.82"]
["SI",{"v":305.807919735401,"d":"305.8"},{"v":235.521835040477,"d":"235.5"},{"v":292.216376489959,"d":"292.2"},{"v":240.439896430371,"d":"240.4"},{"v":188.997308456425,"d":"189.0"},{"v":128.497421884971,"d":"128.5"},{"v":160.863941392809,"d":"160.9"},{"v":335.98372041695,"d":"336.0"},{"v":198.226083428878,"d":"198.2"},{"v":235.521835040477,"d":"235.5"},{"v":231.83938925291568,"d":"231.8"},{"v":69.58148960720953,"d":"69.6"},{"v":0.30012798874009483,"d":"0.3"},{"v":128.497421884971,"d":"128.5"},{"v":335.98372041695,"d":"336.0"},{"v":0.880964172584339,"d":"88%"},{"v":188.997308456425,"d":"189.0"},{"v":292.216376489959,"d":"292.2"},{"v":110.25240979943797,"d":"110.3"},"EXIOBASE 3.10 pxp","GTAP 11"]
["SK",{"v":169.084436423105,"d":"169.1"},{"v":429.075929910542,"d":"429.1"},{"v":138.959741619006,"d":"139.0"},{"v":47.0966257721203,"d":"47.1"},{"v":86.1193303142107,"d":"86.1"},{"v":40.1437452544528,"d":"40.1"},{"v":86.1862102834059,"d":"86.2"},{"v":267.394147819557,"d":"267.4"},{"v":52.0510304991388,"d":"52.1"},{"v":86.1862102834059,"d":"86.2"},{"v":146.23457754394872,"d":"146.2"},{"v":128.66025971427058,"d":"128.7"},{"v":0.8798210510479546,"d":"0.9"},{"v":40.1437452544528,"d":"40.1"},{"v":429.075929910542,"d":"429.1"},{"v":4.512696211808878,"d":"451%"},{"v":52.0510304991388,"d":"52.1"},{"v":169.084436423105,"d":"169.1"},{"v":92.72078224441688,"d":"92.7"},"EXIOBASE 3.10 pxp","JRC"]
["US",{"v":438.912221743761,"d":"438.9"},null,{"v":441.13513896592,"d":"441.1"},{"v":322.471935002654,"d":"322.5"},{"v":457.322286849646,"d":"457.3"},{"v":426.890841621651,"d":"426.9"},{"v":380.967798944558,"d":"381.0"},{"v":425.422489411051,"d":"425.4"},{"v":354.853607093162,"d":"354.9"},{"v":426.15666551635104,"d":"426.2"},{"v":405.99703995405036,"d":"406.0"},{"v":47.78647744392648,"d":"47.8"},{"v":0.11770154149235872,"d":"0.1"},{"v":322.471935002654,"d":"322.5"},{"v":457.322286849646,"d":"457.3"},{"v":0.3164337502115592,"d":"32%"},{"v":374.439250981709,"d":"374.4"},{"v":439.4679510493007,"d":"439.5"},{"v":36.272806871496186,"d":"36.3"},"EORA 199.82","EXIOBASE 3.10 ixi"]

{"sheet":"Stat analysis DCI 2023","index":8,"n_rows":30,"n_cols":17,"rows_kept":30,"merged":[[0,5,0,14],[0,15,0,16]]}
[null,"Physical","Hybrid","Monetary","Monetary","Stats",{"$nulls":9},"Sources comparison"]
["Paese","Electricity Maps","EXIO Hybrid","GLORIA 0.6 act","EMERGING 2","Median","Mean","Standard dev","CV%","Min","Max","Relative \ndispersion%","Q1","Q2","IQR","Source min","Source max"]
["AT",{"v":43.1470856352684,"d":"43.1"},{"v":86.778732693504,"d":"86.8"},{"v":127.905232091796,"d":"127.9"},{"v":214.036940135864,"d":"214.0"},{"$f":"MEDIAN(B3:E3)","v":{"v":107.34198239265,"d":"107.3"}},{"$f":"AVERAGE(B3:E3)","v":{"v":117.96699763910809,"d":"118.0"}},{"$f":"_xlfn.STDEV.S(B3:E3)","v":{"v":72.79864801387937,"d":"72.8"}},{"$f":"H3/G3","v":{"v":0.6171102890707576,"d":"0.6"}},{"$f":"MIN(B3:E3)","v":{"v":43.1470856352684,"d":"43.1"}},{"$f":"MAX(B3:E3)","v":{"v":214.036940135864,"d":"214.0"}},{"$f":"(K3-J3)/F3","v":{"v":1.5920132150670707,"d":"159%"}},{"$f":"QUARTILE(B3:E3,1)","v":{"v":75.8708209289451,"d":"75.9"}},{"$f":"QUARTILE(B3:E3,3)","v":{"v":149.438159102813,"d":"149.4"}},{"$f":"QUARTILE(B3:E3,3)-QUARTILE(B3:D3,1)","v":{"v":84.4752499384268,"d":"84.5"}},{"$f":"INDEX($B$2:$E$2,MATCH(J3,B3:E3,0))","v":"Electricity Maps"},{"$f":"INDEX($B$2:$E$2,MATCH(K3,B3:E3,0))","v":"EMERGING 2"}]
["BE",{"v":121.141616391957,"d":"121.1"},{"v":135.436494016862,"d":"135.4"},{"v":146.677798234752,"d":"146.7"},{"v":185.720995189695,"d":"185.7"},{"$f":"MEDIAN(B4:E4)","v":{"v":141.057146125807,"d":"141.1"}},{"$f":"AVERAGE(B4:E4)","v":{"v":147.24422595831652,"d":"147.2"}},{"$f":"_xlfn.STDEV.S(B4:E4)","v":{"v":27.698082789402715,"d":"27.7"}},{"$f":"H4/G4","v":{"v":0.1881098060663091,"d":"0.2"}},{"$f":"MIN(B4:E4)","v":{"v":121.141616391957,"d":"121.1"}},{"$f":"MAX(B4:E4)","v":{"v":185.720995189695,"d":"185.7"}},{"$f":"(K4-J4)/F4","v":{"v":0.4578242263609992,"d":"46%"}},{"$f":"QUARTILE(B4:E4,1)","v":{"v":131.86277461063577,"d":"131.9"}},{"$f":"QUARTILE(B4:E4,3)","v":{"v":156.43859747348776,"d":"156.4"}},{"$f":"QUARTILE(B4:E4,3)-QUARTILE(B4:D4,1)","v":{"v":28.14954226907824,"d":"28.1"}},"Electricity Maps","EMERGING 2"]
["BG",{"v":405.077249098493,"d":"405.1"},{"v":405.83521384196,"d":"405.8"},{"v":371.41173715937,"d":"371.4"},{"v":185.440453483218,"d":"185.4"},{"v":388.2444931289315,"d":"388.2"},{"v":341.9411633957602,"d":"341.9"},{"v":105.56135959931943,"d":"105.6"},{"v":0.30871205604790986,"d":"0.3"},{"v":185.440453483218,"d":"185.4"},{"v":405.83521384196,"d":"405.8"},{"v":0.5676700230376519,"d":"57%"},{"v":324.918916240332,"d":"324.9"},{"v":405.26674028435974,"d":"405.3"},{"v":17.02224715542826,"d":"17.0"},"EMERGING 2","EXIO Hybrid"]
["CY",null,null,{"v":1061.70940797381,"d":"1,061.7"},{"v":316.483937191983,"d":"316.5"},{"v":689.0966725828964,"d":"689.1"},{"v":689.0966725828964,"d":"689.1"},{"v":526.9539839027673,"d":"527.0"},{"v":0.7647025517154507,"d":"0.8"},{"v":316.483937191983,"d":"316.5"},{"v":1061.70940797381,"d":"1061.7"},{"v":1.0814527198173032,"d":"108%"},{"v":502.79030488743973,"d":"502.8"},{"v":875.4030402783533,"d":"875.4"},{"v":-186.30636769545663,"d":"-186.3"},"EMERGING 2","GLORIA 0.6 act"]
["CZ",{"v":440.537891760986,"d":"440.5"},{"v":443.854775989763,"d":"443.9"},{"v":468.955684159045,"d":"469.0"},{"v":911.657967671818,"d":"911.7"},{"$f":"MEDIAN(B7:E7)","v":{"v":456.405230074404,"d":"456.4"}},{"$f":"AVERAGE(B7:E7)","v":{"v":566.251579895403,"d":"566.3"}},{"$f":"_xlfn.STDEV.S(B7:E7)","v":{"v":230.6201588720904,"d":"230.6"}},{"$f":"H7/G7","v":{"v":0.4072750824195319,"d":"0.4"}},{"$f":"MIN(B7:E7)","v":{"v":440.537891760986,"d":"440.5"}},{"$f":"MAX(B7:E7)","v":{"v":911.657967671818,"d":"911.7"}},{"$f":"(K7-J7)/F7","v":{"v":1.0322407476225222,"d":"103%"}},{"$f":"QUARTILE(B7:E7,1)","v":{"v":443.02555493256875,"d":"443.0"}},{"$f":"QUARTILE(B7:E7,3)","v":{"v":579.6312550372382,"d":"579.6"}},{"$f":"QUARTILE(B7:E7,3)-QUARTILE(B7:D7,1)","v":{"v":137.4349211618637,"d":"137.4"}},"Electricity Maps","EMERGING 2"]
["DE",{"v":328.283563880899,"d":"328.3"},{"v":335.989032771776,"d":"336.0"},{"v":180.818967431388,"d":"180.8"},{"v":176.231113251192,"d":"176.2"},{"v":254.5512656561435,"d":"254.6"},{"v":255.33066933381377,"d":"255.3"},{"v":88.76303642874531,"d":"88.8"},{"v":0.3476395399751153,"d":"0.3"},{"v":176.231113251192,"d":"176.2"},{"v":335.989032771776,"d":"336.0"},{"v":0.6276060702695168,"d":"63%"},{"v":179.67200388633898,"d":"179.7"},{"v":330.20993110361826,"d":"330.2"},{"v":75.65866544747476,"d":"75.7"},"EMERGING 2","EXIO Hybrid"]
["DK",{"v":97.3162430297212,"d":"97.3"},{"v":133.421548934492,"d":"133.4"},{"v":112.304547405526,"d":"112.3"},{"v":147.924351290426,"d":"147.9"},{"v":122.863048170009,"d":"122.9"},{"v":122.7416726650413,"d":"122.7"},{"v":22.387594151699336,"d":"22.4"},{"v":0.18239603278663533,"d":"0.2"},{"v":97.3162430297212,"d":"97.3"},{"v":147.924351290426,"d":"147.9"},{"v":0.41190666367545226,"d":"41%"},{"v":108.5574713115748,"d":"108.6"},{"v":137.0472495234755,"d":"137.0"},{"v":32.23685430585189,"d":"32.2"},"Electricity Maps","EMERGING 2"]
["EE",{"v":382.458517123082,"d":"382.5"},{"v":381.456932671516,"d":"381.5"},{"v":248.208147114025,"d":"248.2"},{"v":345.420057828167,"d":"345.4"},{"v":363.4384952498415,"d":"363.4"},{"v":339.3859136841975,"d":"339.4"},{"v":63.17967979741021,"d":"63.2"},{"v":0.18615881581991536,"d":"0.2"},{"v":248.208147114025,"d":"248.2"},{"v":382.458517123082,"d":"382.5"},{"v":0.36938951642084084,"d":"37%"},{"v":321.1170801496315,"d":"321.1"},{"v":381.7073287844075,"d":"381.7"},{"v":66.87478889163702,"d":"66.9"},"GLORIA 0.6 act","Electricity Maps"]
["ES",{"v":108.38834049378,"d":"108.4"},{"v":137.248234607984,"d":"137.2"},{"v":135.526279975005,"d":"135.5"},{"v":95.430666303937,"d":"95.4"},{"v":121.95731023439251,"d":"122.0"},{"v":119.1483803451765,"d":"119.1"},{"v":20.60864493010357,"d":"20.6"},{"v":0.17296621968674433,"d":"0.2"},{"v":95.430666303937,"d":"95.4"},{"v":137.248234607984,"d":"137.2"},{"v":0.34288693497484374,"d":"34%"},{"v":105.14892194631926,"d":"105.1"},{"v":135.95676863324974,"d":"136.0"},{"v":13.999458398857229,"d":"14.0"},"EMERGING 2","EXIO Hybrid"]
["FI",{"v":47.6015804887368,"d":"47.6"},{"v":76.6709515147702,"d":"76.7"},{"v":104.186560521595,"d":"104.2"},{"v":71.9792738068509,"d":"72.0"},{"v":74.32511266081055,"d":"74.3"},{"v":75.10959158298823,"d":"75.1"},{"v":23.19768329836937,"d":"23.2"},{"v":0.3088511441676308,"d":"0.3"},{"v":47.6015804887368,"d":"47.6"},{"v":104.186560521595,"d":"104.2"},{"v":0.7613171108275198,"d":"76%"},{"v":65.88485047732237,"d":"65.9"},{"v":83.54985376647639,"d":"83.5"},{"v":21.41358776472289,"d":"21.4"},"Electricity Maps","GLORIA 0.6 act"]
["FR",{"v":26.9108666199499,"d":"26.9"},{"v":43.7586509975264,"d":"43.8"},{"v":41.8426124236632,"d":"41.8"},{"v":61.0568183346385,"d":"61.1"},{"v":42.8006317105948,"d":"42.8"},{"v":43.3922370939445,"d":"43.4"},{"v":13.978657528265732,"d":"14.0"},{"v":0.3221465050995605,"d":"0.3"},{"v":26.9108666199499,"d":"26.9"},{"v":61.0568183346385,"d":"61.1"},{"v":0.7977908350879822,"d":"80%"},{"v":38.10967597273488,"d":"38.1"},{"v":48.083192831804425,"d":"48.1"},{"v":13.706453309997876,"d":"13.7"},"Electricity Maps","EMERGING 2"]
["GR",{"v":277.549983116027,"d":"277.5"},{"v":313.16560186641,"d":"313.2"},{"v":355.414352269486,"d":"355.4"},{"v":461.329907508971,"d":"461.3"},{"v":334.28997706794803,"d":"334.3"},{"v":351.86496119022354,"d":"351.9"},{"v":79.61475790296188,"d":"79.6"},{"v":0.22626509224918515,"d":"0.2"},{"v":277.549983116027,"d":"277.5"},{"v":461.329907508971,"d":"461.3"},{"v":0.5497619940773418,"d":"55%"},{"v":304.26169717881425,"d":"304.3"},{"v":381.89324107935727,"d":"381.9"},{"v":86.53544858813876,"d":"86.5"},"Electricity Maps","EMERGING 2"]
["HR",{"v":164.677051902283,"d":"164.7"},{"v":198.039341642639,"d":"198.0"},{"v":154.576166880114,"d":"154.6"},{"v":200.074042432233,"d":"200.1"},{"v":181.35819677246099,"d":"181.4"},{"v":179.34165071431724,"d":"179.3"},{"v":23.15034456371548,"d":"23.2"},{"v":0.12908515379170274,"d":"0.1"},{"v":154.576166880114,"d":"154.6"},{"v":200.074042432233,"d":"200.1"},{"v":0.25087300360183007,"d":"25%"},{"v":162.15183064674076,"d":"162.2"},{"v":198.5480168400375,"d":"198.5"},{"v":38.921407448839005,"d":"38.9"},"GLORIA 0.6 act","EMERGING 2"]
["HU",{"v":210.959167443189,"d":"211.0"},{"v":219.841033080565,"d":"219.8"},{"v":269.228214392808,"d":"269.2"},{"v":342.716116333019,"d":"342.7"},{"v":244.5346237366865,"d":"244.5"},{"v":260.6861328123953,"d":"260.7"},{"v":60.39585695242571,"d":"60.4"},{"v":0.2316803594454717,"d":"0.2"},{"v":210.959167443189,"d":"211.0"},{"v":342.716116333019,"d":"342.7"},{"v":0.5388069258924459,"d":"54%"},{"v":217.620566671221,"d":"217.6"},{"v":287.60018987786077,"d":"287.6"},{"v":72.20008961598376,"d":"72.2"},"Electricity Maps","EMERGING 2"]
["IE",{"v":299.496217352455,"d":"299.5"},{"v":304.41908507138,"d":"304.4"},{"v":409.403895980117,"d":"409.4"},{"v":303.606351555155,"d":"303.6"},{"v":304.0127183132675,"d":"304.0"},{"v":329.23138748977675,"d":"329.2"},{"v":53.49175724253161,"d":"53.5"},{"v":0.16247465847767212,"d":"0.2"},{"v":299.496217352455,"d":"299.5"},{"v":409.403895980117,"d":"409.4"},{"v":0.3615232916486359,"d":"36%"},{"v":302.57881800448,"d":"302.6"},{"v":330.66528779856424,"d":"330.7"},{"v":28.707636586646743,"d":"28.7"},"Electricity Maps","GLORIA 0.6 act"]
["IT",{"v":294.727286375012,"d":"294.7"},{"v":331.747962859068,"d":"331.7"},{"v":177.590114712923,"d":"177.6"},{"v":170.48017727449,"d":"170.5"},{"v":236.15870054396748,"d":"236.2"},{"v":243.63638530537324,"d":"243.6"},{"v":81.82882724268067,"d":"81.8"},{"v":0.3358645595571311,"d":"0.3"},{"v":170.48017727449,"d":"170.5"},{"v":331.747962859068,"d":"331.7"},{"v":0.6828788658351953,"d":"68%"},{"v":175.81263035331474,"d":"175.8"},{"v":303.982455496026,"d":"304.0"},{"v":67.8237549520585,"d":"67.8"},"EMERGING 2","EXIO Hybrid"]
["LT",{"v":57.4360307139693,"d":"57.4"},{"v":77.9803445036844,"d":"78.0"},{"v":68.439264827878,"d":"68.4"},{"v":75.0651297224272,"d":"75.1"},{"v":71.75219727515261,"d":"71.8"},{"v":69.73019244198971,"d":"69.7"},{"v":9.116641770719658,"d":"9.1"},{"v":0.13074166944690452,"d":"0.1"},{"v":57.4360307139693,"d":"57.4"},{"v":77.9803445036844,"d":"78.0"},{"v":0.2863231311360758,"d":"29%"},{"v":65.68845629940083,"d":"65.7"},{"v":75.7939334177415,"d":"75.8"},{"v":12.856285646817845,"d":"12.9"},"Electricity Maps","EXIO Hybrid"]
["LU",null,null,{"v":25.2874458696384,"d":"25.3"},{"v":198.097670980379,"d":"198.1"},{"v":111.69255842500871,"d":"111.7"},{"v":111.6925584250087,"d":"111.7"},{"v":122.1952820341785,"d":"122.2"},{"v":1.0940324383044857,"d":"1.1"},{"v":25.2874458696384,"d":"25.3"},{"v":198.097670980379,"d":"198.1"},{"v":1.5471955119263097,"d":"155%"},{"v":68.49000214732355,"d":"68.5"},{"v":154.89511470269386,"d":"154.9"},{"v":129.60766883305547,"d":"129.6"},"GLORIA 0.6 act","EMERGING 2"]
["LV",{"v":103.634036950648,"d":"103.6"},{"v":159.562268728157,"d":"159.6"},{"v":30.3846442885484,"d":"30.4"},{"v":352.62602967719,"d":"352.6"},{"v":131.5981528394025,"d":"131.6"},{"v":161.55174491113584,"d":"161.6"},{"v":137.92825368704575,"d":"137.9"},{"v":0.8537713644808691,"d":"0.9"},{"v":30.3846442885484,"d":"30.4"},{"v":352.62602967719,"d":"352.6"},{"v":2.448677116174214,"d":"245%"},{"v":85.3216887851231,"d":"85.3"},{"v":207.82820896541523,"d":"207.8"},{"v":140.81886834581704,"d":"140.8"},"GLORIA 0.6 act","EMERGING 2"]
["MT",null,null,{"v":114.354650745735,"d":"114.4"},{"v":315.628765895602,"d":"315.6"},{"v":214.9917083206685,"d":"215.0"},{"v":214.9917083206685,"d":"215.0"},{"v":142.32229169979297,"d":"142.3"},{"v":0.6619896777019593,"d":"0.7"},{"v":114.354650745735,"d":"114.4"},{"v":315.628765895602,"d":"315.6"},{"v":0.9361947803571048,"d":"94%"},{"v":164.67317953320173,"d":"164.7"},{"v":265.31023710813525,"d":"265.3"},{"v":150.95558636240025,"d":"151.0"},"GLORIA 0.6 act","EMERGING 2"]
["NL",{"v":405.869773683662,"d":"405.9"},{"v":261.452500801764,"d":"261.5"},{"v":323.493412260382,"d":"323.5"},{"v":163.356872216186,"d":"163.4"},{"v":292.472956531073,"d":"292.5"},{"v":288.54313974049853,"d":"288.5"},{"v":102.29461516688744,"d":"102.3"},{"v":0.3545210440937399,"d":"0.4"},{"v":163.356872216186,"d":"163.4"},{"v":405.869773683662,"d":"405.9"},{"v":0.8291805996145523,"d":"83%"},{"v":236.92859365536953,"d":"236.9"},{"v":344.087502616202,"d":"344.1"},{"v":51.61454608512901,"d":"51.6"},"EMERGING 2","Electricity Maps"]
["PL",{"v":728.438480379316,"d":"728.4"},{"v":620.892704443904,"d":"620.9"},{"v":735.690225591952,"d":"735.7"},{"v":761.991798759939,"d":"762.0"},{"v":732.0643529856341,"d":"732.1"},{"v":711.7533022937778,"d":"711.8"},{"v":62.26536285272838,"d":"62.3"},{"v":0.08748166345286335,"d":"0.1"},{"v":620.892704443904,"d":"620.9"},{"v":761.991798759939,"d":"762.0"},{"v":0.19274138091901316,"d":"19%"},{"v":701.552036395463,"d":"701.6"},{"v":742.2656188839487,"d":"742.3"},{"v":67.60002647233864,"d":"67.6"},"EXIO Hybrid","EMERGING 2"]
["PT",{"v":86.6269073910136,"d":"86.6"},{"v":120.920084354369,"d":"120.9"},{"v":124.763560484759,"d":"124.8"},{"v":128.622065034873,"d":"128.6"},{"v":122.841822419564,"d":"122.8"},{"v":115.23315431625365,"d":"115.2"},{"v":19.328304878028657,"d":"19.3"},{"v":0.16773215133018707,"d":"0.2"},{"v":86.6269073910136,"d":"86.6"},{"v":128.622065034873,"d":"128.6"},{"v":0.34186368141320556,"d":"34%"},{"v":112.34679011353015,"d":"112.3"},{"v":125.7281866222875,"d":"125.7"},{"v":21.954690749596196,"d":"22.0"},"Electricity Maps","EMERGING 2"]
["RO",{"v":272.785313010663,"d":"272.8"},{"v":265.597704088613,"d":"265.6"},{"v":89.5011341178148,"d":"89.5"},{"v":902.301593250669,"d":"902.3"},{"v":269.191508549638,"d":"269.2"},{"v":382.54643611693996,"d":"382.5"},{"v":356.71906895083447,"d":"356.7"},{"v":0.9324856678099849,"d":"0.9"},{"v":89.5011341178148,"d":"89.5"},{"v":902.301593250669,"d":"902.3"},{"v":3.0194134410557627,"d":"302%"},{"v":221.57356159591347,"d":"221.6"},{"v":430.1643830706645,"d":"430.2"},{"v":252.6149639674506,"d":"252.6"},"GLORIA 0.6 act","EMERGING 2"]
["SE",{"v":1.34285761234806,"d":"1.3"},{"v":0.0325183096535548,"d":"0.0"},{"v":28.2696796579396,"d":"28.3"},{"v":13.7200850124078,"d":"13.7"},{"v":7.5314713123779296,"d":"7.5"},{"v":10.841285148087255,"d":"10.8"},{"v":13.154036010152623,"d":"13.2"},{"v":1.2133281092116104,"d":"1.2"},{"v":0.0325183096535548,"d":"0.0"},{"v":28.2696796579396,"d":"28.3"},{"v":3.74922245297256,"d":"375%"},{"v":1.0152727866744338,"d":"1.0"},{"v":17.35748367379075,"d":"17.4"},{"v":16.66979571278994,"d":"16.7"},"EXIO Hybrid","GLORIA 0.6 act"]
["SI",{"v":220.884840174579,"d":"220.9"},{"v":213.259027376758,"d":"213.3"},{"v":173.123447174806,"d":"173.1"},{"v":386.4518112607,"d":"386.5"},{"v":217.07193377566853,"d":"217.1"},{"v":248.42978149671075,"d":"248.4"},{"v":94.36954033122474,"d":"94.4"},{"v":0.37986403949912184,"d":"0.4"},{"v":173.123447174806,"d":"173.1"},{"v":386.4518112607,"d":"386.5"},{"v":0.9827542436064385,"d":"98%"},{"v":203.22513232627,"d":"203.2"},{"v":262.2765829461093,"d":"262.3"},{"v":69.08534567032729,"d":"69.1"},"GLORIA 0.6 act","EMERGING 2"]
["SK",{"v":97.6115797787352,"d":"97.6"},{"v":91.140581163509,"d":"91.1"},{"v":123.444869066847,"d":"123.4"},{"v":329.172952563445,"d":"329.2"},{"v":110.52822442279111,"d":"110.5"},{"v":160.34249564313404,"d":"160.3"},{"v":113.41550570610666,"d":"113.4"},{"v":0.7073327956584239,"d":"0.7"},{"v":91.140581163509,"d":"91.1"},{"v":329.172952563445,"d":"329.2"},{"v":2.1535890279881604,"d":"215%"},{"v":95.99383012492865,"d":"96.0"},{"v":174.8768899409965,"d":"174.9"},{"v":80.50080946987441,"d":"80.5"},"EXIO Hybrid","EMERGING 2"]
["US",{"v":341.319498840341,"d":"341.3"},{"v":359.447357573166,"d":"359.4"},{"v":604.760163360947,"d":"604.8"},{"v":581.891269481104,"d":"581.9"},{"v":470.66931352713505,"d":"470.7"},{"v":471.8545723138895,"d":"471.9"},{"v":140.76784456159112,"d":"140.8"},{"v":0.29832887677932435,"d":"0.3"},{"v":341.319498840341,"d":"341.3"},{"v":604.760163360947,"d":"604.8"},{"v":0.5597149781157723,"d":"56%"},{"v":354.9153928899598,"d":"354.9"},{"v":587.6084929510648,"d":"587.6"},{"v":237.22506474431134,"d":"237.2"},"Electricity Maps","GLORIA 0.6 act"]

{"sheet":"Stat analysis LCCI 2017","index":9,"n_rows":30,"n_cols":26,"rows_kept":30,"merged":[[0,14,0,23],[0,24,0,25]]}
[null,"Physical","Physical","Physical","Physical","Physical","Hybrid","Monetary","Monetary","Monetary","Monetary","Monetary","Monetary","Monetary","Stats",{"$nulls":9},"Sources comparison"]
["Paese","Electricity Maps","EMBER","IPCC","JRC","NREL","EXIO Hybrid","EORA 199.82","EXIOBASE 3.10 ixi","EXIOBASE 3.10 pxp","GLORIA 0.6 act","GLORIA 0.6 com","GTAP 11","EMERGING 1","Median","Mean","Standard dev","CV%","Min","Max","Relative \ndispersion%","Q1","Q2","IQR","Source min","Source max"]
["AT",{"v":156,"d":"156.0"},{"v":163,"d":"163.0"},{"v":131.242990075727,"d":"131.2"},{"v":292.54487493272,"d":"292.5"},{"v":126.763079335538,"d":"126.8"},{"v":430.33541285864,"d":"430.3"},{"v":103.247267457186,"d":"103.2"},{"v":73.6006465109312,"d":"73.6"},{"v":64.26481545102,"d":"64.3"},{"v":155.194050018065,"d":"155.2"},{"v":155.192090041063,"d":"155.2"},{"v":252.466224046482,"d":"252.5"},{"v":66.4088106037095,"d":"66.4"},{"$f":"MEDIAN(B3:N3)","v":{"v":155.192090041063,"d":"155.2"}},{"$f":"AVERAGE(B3:N3)","v":{"v":166.9430970254678,"d":"166.9"}},{"$f":"_xlfn.STDEV.S(B3:N3)","v":{"v":103.7568572231564,"d":"103.8"}},{"$f":"Q3/P3","v":{"v":0.6215103174186825,"d":"0.6"}},{"$f":"MIN(B3:N3)","v":{"v":64.26481545102,"d":"64.3"}},{"$f":"MAX(B3:N3)","v":{"v":430.33541285864,"d":"430.3"}},{"$f":"(T3-S3)/O3","v":{"v":2.3588225231760176,"d":"236%"}},{"$f":"QUARTILE(B3:N3,1)","v":{"v":103.247267457186,"d":"103.2"}},{"$f":"QUARTILE(B3:N3,3)","v":{"v":163,"d":"163.0"}},{"$f":"QUARTILE(B3:N3,3)-QUARTILE(B3:M3,1)","v":{"v":42.115873634050004,"d":"42.1"}},{"$f":"INDEX($B$2:$N$2,MATCH(S3,B3:N3,0))","v":"EXIOBASE 3.10 pxp"},{"$f":"INDEX($B$2:$N$2,MATCH(T3,B3:N3,0))","v":"EXIO Hybrid"}]
["BE",{"v":203,"d":"203.0"},{"v":159,"d":"159.0"},{"v":163.10527269323,"d":"163.1"},{"v":230.388555151416,"d":"230.4"},{"v":163.018461452407,"d":"163.0"},{"v":322.754849089848,"d":"322.8"},{"v":209.198119875687,"d":"209.2"},{"v":150.603430578194,"d":"150.6"},{"v":133.058553638512,"d":"133.1"},{"v":187.505965899844,"d":"187.5"},{"v":187.508640749927,"d":"187.5"},{"v":235.624318285158,"d":"235.6"},{"v":80.1962169691393,"d":"80.2"},{"$f":"MEDIAN(B4:N4)","v":{"v":187.505965899844,"d":"187.5"}},{"$f":"AVERAGE(B4:N4)","v":{"v":186.5355680294894,"d":"186.5"}},{"$f":"_xlfn.STDEV.S(B4:N4)","v":{"v":58.448158963418265,"d":"58.4"}},{"$f":"Q4/P4","v":{"v":0.3133351970396241,"d":"0.3"}},{"$f":"MIN(B4:N4)","v":{"v":80.1962169691393,"d":"80.2"}},{"$f":"MAX(B4:N4)","v":{"v":322.754849089848,"d":"322.8"}},{"$f":"(T4-S4)/O4","v":{"v":1.293604877885704,"d":"129%"}},{"$f":"QUARTILE(B4:N4,1)","v":{"v":159,"d":"159.0"}},{"$f":"QUARTILE(B4:N4,3)","v":{"v":209.198119875687,"d":"209.2"}},{"$f":"QUARTILE(B4:N4,3)-QUARTILE(B4:M4,1)","v":{"v":47.184273786381766,"d":"47.2"}},{"$f":"INDEX($B$2:$N$2,MATCH(S4,B4:N4,0))","v":"EMERGING 1"},{"$f":"INDEX($B$2:$N$2,MATCH(T4,B4:N4,0))","v":"EXIO Hybrid"}]
["BG",{"v":552,"d":"552.0"},{"v":503,"d":"503.0"},{"v":414.849096775665,"d":"414.8"},{"v":573.845753702202,"d":"573.8"},{"v":489.598867516456,"d":"489.6"},{"v":816.818512395285,"d":"816.8"},{"v":386.525992743165,"d":"386.5"},{"v":418.167885316954,"d":"418.2"},{"v":443.016560952193,"d":"443.0"},{"v":731.602530955137,"d":"731.6"},{"v":731.593845601563,"d":"731.6"},{"v":507.905813758151,"d":"507.9"},{"v":749.402474932384,"d":"749.4"},{"v":507.905813758151,"d":"507.9"},{"v":562.9482565114733,"d":"562.9"},{"v":146.2720757533383,"d":"146.3"},{"v":0.25983218539439096,"d":"0.3"},{"v":386.525992743165,"d":"386.5"},{"v":816.818512395285,"d":"816.8"},{"v":0.8471895930236624,"d":"85%"},{"v":443.016560952193,"d":"443.0"},{"v":731.593845601563,"d":"731.6"},{"v":294.78945355817973,"d":"294.8"},"EORA 199.82","EXIO Hybrid"]
["CY",{"v":897,"d":"897.0"},{"v":606,"d":"606.0"},{"v":0,"d":"0.0"},{"v":858.811902888308,"d":"858.8"},null,null,{"v":789.361158218997,"d":"789.4"},{"v":507.015568224276,"d":"507.0"},{"v":508.760375106235,"d":"508.8"},{"v":554.3883511612,"d":"554.4"},{"v":554.383790979382,"d":"554.4"},{"v":170.42295534131,"d":"170.4"},{"v":439.988045359648,"d":"440.0"},{"v":554.383790979382,"d":"554.4"},{"v":535.1029224799414,"d":"535.1"},{"v":271.2988406915432,"d":"271.3"},{"v":0.5070031003273262,"d":"0.5"},{"v":0,"d":"0.0"},{"v":897,"d":"897.0"},{"v":1.618012673883101,"d":"162%"},{"v":473.50180679196205,"d":"473.5"},{"v":697.6805791094985,"d":"697.7"},{"v":190.2288091647327,"d":"190.2"},"IPCC","Electricity Maps"]
["CZ",{"v":601,"d":"601.0"},{"v":542,"d":"542.0"},{"v":452.130052426506,"d":"452.1"},{"v":624.089843691911,"d":"624.1"},{"v":533.732465312445,"d":"533.7"},{"v":1164.76073465483,"d":"1,164.8"},{"v":471.240627519549,"d":"471.2"},{"v":304.678135005707,"d":"304.7"},{"v":307.799784953648,"d":"307.8"},{"v":461.594420157288,"d":"461.6"},{"v":461.584811306268,"d":"461.6"},{"v":622.230662904813,"d":"622.2"},{"v":245.053103699593,"d":"245.1"},{"v":471.240627519549,"d":"471.2"},{"v":522.4534339717352,"d":"522.5"},{"v":228.20917359727775,"d":"228.2"},{"v":0.4368028971738444,"d":"0.4"},{"v":245.053103699593,"d":"245.1"},{"v":1164.76073465483,"d":"1164.8"},{"v":1.9516730460959326,"d":"195%"},{"v":452.130052426506,"d":"452.1"},{"v":601,"d":"601.0"},{"v":141.7788784136725,"d":"141.8"},"EMERGING 1","EXIO Hybrid"]
["DE",{"v":520,"d":"520.0"},{"v":470,"d":"470.0"},{"v":409.880109215017,"d":"409.9"},{"v":441.606336190274,"d":"441.6"},{"v":470.794870307167,"d":"470.8"},{"v":761.224172274081,"d":"761.2"},{"v":198.769475365785,"d":"198.8"},{"v":206.53895479306,"d":"206.5"},{"v":186.771182518975,"d":"186.8"},{"v":270.343134234175,"d":"270.3"},{"v":270.352471614507,"d":"270.4"},{"v":705.129561199668,"d":"705.1"},{"v":393.658132575704,"d":"393.7"},{"v":409.880109215017,"d":"409.9"},{"v":408.08218463757026,"d":"408.1"},{"v":183.92150032327413,"d":"183.9"},{"v":0.4506972057273713,"d":"0.5"},{"v":186.771182518975,"d":"186.8"},{"v":761.224172274081,"d":"761.2"},{"v":1.4015146791467172,"d":"140%"},{"v":270.343134234175,"d":"270.3"},{"v":470.794870307167,"d":"470.8"},{"v":216.40278093327075,"d":"216.4"},"EXIOBASE 3.10 pxp","EXIO Hybrid"]
["DK",{"v":294,"d":"294.0"},{"v":283,"d":"283.0"},{"v":262.812045041012,"d":"262.8"},{"v":170.596875513752,"d":"170.6"},{"v":293.691688173306,"d":"293.7"},{"v":471.119662558958,"d":"471.1"},{"v":216.456811816472,"d":"216.5"},{"v":30.1170478200887,"d":"30.1"},{"v":17.175492012231,"d":"17.2"},{"v":154.371241165503,"d":"154.4"},{"v":154.370888944304,"d":"154.4"},{"v":208.346923674481,"d":"208.3"},{"v":70.5109620457102,"d":"70.5"},{"v":208.346923674481,"d":"208.3"},{"v":202.04381836660136,"d":"202.0"},{"v":124.6065552669987,"d":"124.6"},{"v":0.616730352229359,"d":"0.6"},{"v":17.175492012231,"d":"17.2"},{"v":471.119662558958,"d":"471.1"},{"v":2.1787898882345127,"d":"218%"},{"v":154.370888944304,"d":"154.4"},{"v":283,"d":"283.0"},{"v":128.62884688979676,"d":"128.6"},"EXIOBASE 3.10 pxp","EXIO Hybrid"]
["EE",{"v":778,"d":"778.0"},{"v":583,"d":"583.0"},{"v":782.286269562617,"d":"782.3"},{"v":725.161843903765,"d":"725.2"},{"v":789.087513091916,"d":"789.1"},{"v":1406.68201865837,"d":"1,406.7"},{"v":582.443816895143,"d":"582.4"},{"v":290.893520216821,"d":"290.9"},{"v":260.721087907224,"d":"260.7"},{"v":647.294679637866,"d":"647.3"},{"v":647.291613870309,"d":"647.3"},{"v":961.080883136502,"d":"961.1"},{"v":746.388584176255,"d":"746.4"},{"v":725.161843903765,"d":"725.2"},{"v":707.7178331582144,"d":"707.7"},{"v":286.32201398932733,"d":"286.3"},{"v":0.4045708622483142,"d":"0.4"},{"v":260.721087907224,"d":"260.7"},{"v":1406.68201865837,"d":"1406.7"},{"v":1.580282995285704,"d":"158%"},{"v":583,"d":"583.0"},{"v":782.286269562617,"d":"782.3"},{"v":199.4253153388313,"d":"199.4"},"EXIOBASE 3.10 pxp","EXIO Hybrid"]
["ES",{"v":329,"d":"329.0"},{"v":329,"d":"329.0"},{"v":280.242680563106,"d":"280.2"},{"v":301.47472727138,"d":"301.5"},{"v":307.652466233559,"d":"307.7"},{"v":599.671462830354,"d":"599.7"},{"v":236.532161328815,"d":"236.5"},{"v":259.854352633433,"d":"259.9"},{"v":214.663413820495,"d":"214.7"},{"v":270.715798117676,"d":"270.7"},{"v":270.719546256305,"d":"270.7"},{"v":367.273783651703,"d":"367.3"},{"v":137.948550062581,"d":"137.9"},{"v":280.242680563106,"d":"280.2"},{"v":300.3653032899544,"d":"300.4"},{"v":106.98826021873484,"d":"107.0"},{"v":0.35619380483322627,"d":"0.4"},{"v":137.948550062581,"d":"137.9"},{"v":599.671462830354,"d":"599.7"},{"v":1.647582416211583,"d":"165%"},{"v":259.854352633433,"d":"259.9"},{"v":329,"d":"329.0"},{"v":60.999563253384736,"d":"61.0"},"EMERGING 1","EXIO Hybrid"]
["FI",{"v":229,"d":"229.0"},{"v":186,"d":"186.0"},{"v":200.90553040558,"d":"200.9"},{"v":95.4827773945797,"d":"95.5"},{"v":223.210252076861,"d":"223.2"},{"v":627.107029124665,"d":"627.1"},{"v":247.192503720248,"d":"247.2"},{"v":70.9130068214398,"d":"70.9"},{"v":62.889255658774,"d":"62.9"},{"v":157.883611656866,"d":"157.9"},{"v":157.882953517739,"d":"157.9"},{"v":226.871184240338,"d":"226.9"},{"v":152.35186906674,"d":"152.4"},{"v":186,"d":"186.0"},{"v":202.89922874491006,"d":"202.9"},{"v":141.13867566008096,"d":"141.1"},{"v":0.6956097198256185,"d":"0.7"},{"v":62.889255658774,"d":"62.9"},{"v":627.107029124665,"d":"627.1"},{"v":3.0334288896015646,"d":"303%"},{"v":152.35186906674,"d":"152.4"},{"v":226.871184240338,"d":"226.9"},{"v":84.58827475338884,"d":"84.6"},"EXIOBASE 3.10 pxp","EXIO Hybrid"]
["FR",{"v":72,"d":"72.0"},78.3,{"v":72.3443795929794,"d":"72.3"},{"v":86.1057675252705,"d":"86.1"},{"v":74.7433703198906,"d":"74.7"},{"v":199.5382689619,"d":"199.5"},{"v":78.0972766549417,"d":"78.1"},{"v":62.7787155338539,"d":"62.8"},{"v":63.0061264428128,"d":"63.0"},{"v":105.607204396149,"d":"105.6"},{"v":105.603678152181,"d":"105.6"},{"v":134.654608271381,"d":"134.7"},{"v":59.1521232190004,"d":"59.2"},{"v":78.0972766549417,"d":"78.1"},{"v":91.68703992848926,"d":"91.7"},{"v":38.758011268498784,"d":"38.8"},{"v":0.4227207171125587,"d":"0.4"},{"v":59.1521232190004,"d":"59.2"},{"v":199.5382689619,"d":"199.5"},{"v":1.7975805528170938,"d":"180%"},{"v":72,"d":"72.0"},{"v":105.603678152181,"d":"105.6"},{"v":33.34539345744646,"d":"33.3"},"EMERGING 1","EXIO Hybrid"]
["GR",{"v":776,"d":"776.0"},{"v":580,"d":"580.0"},{"v":494.790972952963,"d":"494.8"},{"v":651.403417464393,"d":"651.4"},{"v":553.866618313399,"d":"553.9"},{"v":831.495916485166,"d":"831.5"},{"v":587.488965016722,"d":"587.5"},{"v":246.704204861369,"d":"246.7"},{"v":231.742310682493,"d":"231.7"},{"v":329.062129776439,"d":"329.1"},{"v":329.071017651543,"d":"329.1"},{"v":840.274530831422,"d":"840.3"},{"v":415.907532338337,"d":"415.9"},{"v":553.866618313399,"d":"553.9"},{"v":528.2928935672497,"d":"528.3"},{"v":210.7488594077538,"d":"210.7"},{"v":0.3989242747232341,"d":"0.4"},{"v":231.742310682493,"d":"231.7"},{"v":840.274530831422,"d":"840.3"},{"v":1.0986981342222688,"d":"110%"},{"v":329.071017651543,"d":"329.1"},{"v":651.403417464393,"d":"651.4"},{"v":322.33462178162597,"d":"322.3"},"EXIOBASE 3.10 pxp","GTAP 11"]
["HR",{"v":261,"d":"261.0"},{"v":256,"d":"256.0"},{"v":246.688073394495,"d":"246.7"},{"v":385.976740925831,"d":"386.0"},{"v":259.009174311926,"d":"259.0"},{"v":432.947486809655,"d":"432.9"},{"v":237.545216605241,"d":"237.5"},{"v":213.073026924602,"d":"213.1"},{"v":180.1274006337,"d":"180.1"},{"v":155.282094252143,"d":"155.3"},{"v":155.284235976317,"d":"155.3"},{"v":376.695448364876,"d":"376.7"},{"v":116.226797087067,"d":"116.2"},{"v":246.688073394495,"d":"246.7"},{"v":251.98889963737332,"d":"252.0"},{"v":95.93732063581972,"d":"95.9"},{"v":0.3807204236927861,"d":"0.4"},{"v":116.226797087067,"d":"116.2"},{"v":432.947486809655,"d":"432.9"},{"v":1.2838913749028282,"d":"128%"},{"v":180.1274006337,"d":"180.1"},{"v":261,"d":"261.0"},{"v":56.16337964812351,"d":"56.2"},"EMERGING 1","EXIO Hybrid"]
["HU",{"v":354,"d":"354.0"},{"v":291,"d":"291.0"},{"v":270.040391731327,"d":"270.0"},{"v":289.24713013931,"d":"289.2"},{"v":296.503621153509,"d":"296.5"},{"v":454.569702210075,"d":"454.6"},{"v":239.446076362253,"d":"239.4"},{"v":152.726084178552,"d":"152.7"},{"v":158.756266208056,"d":"158.8"},{"v":234.327202900357,"d":"234.3"},{"v":234.329370093648,"d":"234.3"},{"v":318.188121550851,"d":"318.2"},{"v":123.146063451278,"d":"123.1"},{"v":270.040391731327,"d":"270.0"},{"v":262.79077153686274,"d":"262.8"},{"v":89.18857354029548,"d":"89.2"},{"v":0.33939005170805486,"d":"0.3"},{"v":123.146063451278,"d":"123.1"},{"v":454.569702210075,"d":"454.6"},{"v":1.2273113538086642,"d":"123%"},{"v":234.327202900357,"d":"234.3"},{"v":296.503621153509,"d":"296.5"},{"v":62.174792858183764,"d":"62.2"},"EMERGING 1","EXIO Hybrid"]
["IE",{"v":409,"d":"409.0"},{"v":404,"d":"404.0"},{"v":453.496781830103,"d":"453.5"},{"v":401.095296514862,"d":"401.1"},{"v":488.424513451321,"d":"488.4"},{"v":775.996568786361,"d":"776.0"},{"v":381.487877899626,"d":"381.5"},{"v":343.131429637519,"d":"343.1"},{"v":328.640575645619,"d":"328.6"},{"v":395.583917914407,"d":"395.6"},{"v":395.585653724644,"d":"395.6"},{"v":637.917613818823,"d":"637.9"},{"v":268.456242802145,"d":"268.5"},{"v":401.095296514862,"d":"401.1"},{"v":437.1397286173408,"d":"437.1"},{"v":134.42382805166486,"d":"134.4"},{"v":0.3075076897651083,"d":"0.3"},{"v":268.456242802145,"d":"268.5"},{"v":775.996568786361,"d":"776.0"},{"v":1.265385883091276,"d":"127%"},{"v":381.487877899626,"d":"381.5"},{"v":453.496781830103,"d":"453.5"},{"v":61.436873919391246,"d":"61.4"},"EMERGING 1","EXIO Hybrid"]
["IT",{"v":456,"d":"456.0"},{"v":393,"d":"393.0"},{"v":322.423349682108,"d":"322.4"},{"v":381.987445936013,"d":"382.0"},{"v":339.897108941226,"d":"339.9"},{"v":720.438109712359,"d":"720.4"},{"v":246.164341781005,"d":"246.2"},{"v":243.318691842478,"d":"243.3"},{"v":226.83017901127,"d":"226.8"},{"v":284.711437444385,"d":"284.7"},{"v":284.710263757002,"d":"284.7"},{"v":392.239861393998,"d":"392.2"},{"v":147.298303238273,"d":"147.3"},{"v":322.423349682108,"d":"322.4"},{"v":341.4630071338551,"d":"341.5"},{"v":141.41510018146758,"d":"141.4"},{"v":0.41414471619771154,"d":"0.4"},{"v":147.298303238273,"d":"147.3"},{"v":720.438109712359,"d":"720.4"},{"v":1.7776001863362905,"d":"178%"},{"v":246.164341781005,"d":"246.2"},{"v":392.239861393998,"d":"392.2"},{"v":117.16607813099529,"d":"117.2"},"EMERGING 1","EXIO Hybrid"]
["LT",{"v":190,"d":"190.0"},{"v":183,"d":"183.0"},{"v":146.581444340072,"d":"146.6"},{"v":89.0415362509898,"d":"89.0"},{"v":142.55640551513,"d":"142.6"},{"v":284.476305134729,"d":"284.5"},{"v":247.290726365643,"d":"247.3"},{"v":44.8250761685431,"d":"44.8"},{"v":36.8210148532313,"d":"36.8"},{"v":93.3643243929463,"d":"93.4"},{"v":93.3660121572359,"d":"93.4"},{"v":93.1427627791806,"d":"93.1"},{"v":30.4253098442806,"d":"30.4"},{"v":93.3660121572359,"d":"93.4"},{"v":128.83776290784473,"d":"128.8"},{"v":79.59091967812972,"d":"79.6"},{"v":0.6177608015055309,"d":"0.6"},{"v":30.4253098442806,"d":"30.4"},{"v":284.476305134729,"d":"284.5"},{"v":2.7210222373277118,"d":"272%"},{"v":89.0415362509898,"d":"89.0"},{"v":183,"d":"183.0"},{"v":90.8825438528671,"d":"90.9"},"EMERGING 1","EXIO Hybrid"]
["LU",{"$nulls":3},{"v":363.383756005322,"d":"363.4"},null,null,{"v":108.259885276664,"d":"108.3"},{"v":73.8953721845488,"d":"73.9"},{"v":43.1404882315478,"d":"43.1"},{"v":38.6953922486377,"d":"38.7"},{"v":38.6954671580677,"d":"38.7"},{"v":242.108058069618,"d":"242.1"},{"v":556.426893302162,"d":"556.4"},{"v":91.07762873060639,"d":"91.1"},{"v":183.075664059571,"d":"183.1"},{"v":190.55477892907933,"d":"190.6"},{"v":1.0408525890534237,"d":"1.0"},{"v":38.6953922486377,"d":"38.7"},{"v":556.426893302162,"d":"556.4"},{"v":5.6845079112115915,"d":"568%"},{"v":42.029232963177776,"d":"42.0"},{"v":272.426982553544,"d":"272.4"},{"v":231.50900485873626,"d":"231.5"},"GLORIA 0.6 act","EMERGING 1"]
["LV",{"v":211,"d":"211.0"},{"v":141,"d":"141.0"},{"v":149.212424095149,"d":"149.2"},{"v":477.03874876017,"d":"477.0"},{"v":139.731769775953,"d":"139.7"},{"v":252.123515180604,"d":"252.1"},{"v":249.343724712646,"d":"249.3"},{"v":55.1310888329613,"d":"55.1"},{"v":35.3553512531757,"d":"35.4"},{"v":147.128620356533,"d":"147.1"},{"v":147.12668534786,"d":"147.1"},{"v":200.074225741454,"d":"200.1"},{"v":82.3476061137428,"d":"82.3"},{"v":147.128620356533,"d":"147.1"},{"v":175.89336616694223,"d":"175.9"},{"v":112.43109211670483,"d":"112.4"},{"v":0.6392002982647754,"d":"0.6"},{"v":35.3553512531757,"d":"35.4"},{"v":477.03874876017,"d":"477.0"},{"v":3.0020222879591634,"d":"300%"},{"v":139.731769775953,"d":"139.7"},{"v":211,"d":"211.0"},{"v":70.31705755601175,"d":"70.3"},"EXIOBASE 3.10 pxp","JRC"]
["MT",{"$nulls":3},{"v":492.486586769273,"d":"492.5"},null,null,{"v":586.744002307307,"d":"586.7"},{"v":190.146788486087,"d":"190.1"},{"v":141.791313019802,"d":"141.8"},{"v":246.171081626044,"d":"246.2"},{"v":246.170173257212,"d":"246.2"},{"v":641.992431208696,"d":"642.0"},{"v":261.213352410171,"d":"261.2"},{"v":253.6922170181075,"d":"253.7"},{"v":350.839466135574,"d":"350.8"},{"v":192.70708522128155,"d":"192.7"},{"v":0.5492742516795822,"d":"0.5"},{"v":141.791313019802,"d":"141.8"},{"v":641.992431208696,"d":"642.0"},{"v":1.9716849183165586,"d":"197%"},{"v":232.16432706443075,"d":"232.2"},{"v":516.0509406537815,"d":"516.1"},{"v":297.892459782132,"d":"297.9"},"EXIOBASE 3.10 pxp","GTAP 11"]
["NL",{"v":579,"d":"579.0"},{"v":490,"d":"490.0"},{"v":560.591163735198,"d":"560.6"},{"v":476.348166648369,"d":"476.3"},{"v":618.265168265679,"d":"618.3"},{"v":663.793767413947,"d":"663.8"},{"v":215.608865994451,"d":"215.6"},{"v":256.590592100254,"d":"256.6"},{"v":231.545821972892,"d":"231.5"},{"v":305.623133819457,"d":"305.6"},{"v":305.63060235616,"d":"305.6"},{"v":516.67774387139,"d":"516.7"},{"v":329.745877370118,"d":"329.7"},{"v":476.348166648369,"d":"476.3"},{"v":426.8785310421473,"d":"426.9"},{"v":157.82362297673285,"d":"157.8"},{"v":0.36971553146848307,"d":"0.4"},{"v":215.608865994451,"d":"215.6"},{"v":663.793767413947,"d":"663.8"},{"v":0.940876721690707,"d":"94%"},{"v":305.623133819457,"d":"305.6"},{"v":560.591163735198,"d":"560.6"},{"v":267.2261653455418,"d":"267.2"},"EORA 199.82","EXIO Hybrid"]
["PL",{"v":956,"d":"956.0"},{"v":806,"d":"806.0"},{"v":711.590664021159,"d":"711.6"},{"v":872.772117162336,"d":"872.8"},{"v":843.814702084928,"d":"843.8"},{"v":1641.52595865028,"d":"1,641.5"},{"v":374.555498539324,"d":"374.6"},{"v":460.653154638813,"d":"460.7"},{"v":404.150612698974,"d":"404.2"},{"v":629.194758083597,"d":"629.2"},{"v":629.195334587486,"d":"629.2"},{"v":865.993638565104,"d":"866.0"},{"v":428.950998384848,"d":"429.0"},{"v":711.590664021159,"d":"711.6"},{"v":740.3382644166807,"d":"740.3"},{"v":335.9728526915987,"d":"336.0"},{"v":0.45380992559707123,"d":"0.5"},{"v":374.555498539324,"d":"374.6"},{"v":1641.52595865028,"d":"1641.5"},{"v":1.7804765073102238,"d":"178%"},{"v":460.653154638813,"d":"460.7"},{"v":865.993638565104,"d":"866.0"},{"v":278.934281342703,"d":"278.9"},"EORA 199.82","EXIO Hybrid"]
["PT",{"v":476,"d":"476.0"},{"v":434,"d":"434.0"},{"v":383.216395741781,"d":"383.2"},{"v":352.698875652606,"d":"352.7"},{"v":420.91612446686,"d":"420.9"},{"v":724.825148034035,"d":"724.8"},{"v":243.254754368819,"d":"243.3"},{"v":290.17637492933,"d":"290.2"},{"v":250.611186367064,"d":"250.6"},{"v":282.518377651711,"d":"282.5"},{"v":282.509896162772,"d":"282.5"},{"v":566.002838895084,"d":"566.0"},{"v":457.461313516573,"d":"457.5"},{"v":383.216395741781,"d":"383.2"},{"v":397.2454835220488,"d":"397.2"},{"v":139.25792333920035,"d":"139.3"},{"v":0.35055885873016085,"d":"0.4"},{"v":243.254754368819,"d":"243.3"},{"v":724.825148034035,"d":"724.8"},{"v":1.2566539402184345,"d":"126%"},{"v":282.518377651711,"d":"282.5"},{"v":457.461313516573,"d":"457.5"},{"v":174.94505623709676,"d":"174.9"},"EORA 199.82","EXIO Hybrid"]
["RO",{"v":488,"d":"488.0"},{"v":369,"d":"369.0"},{"v":317.846935983284,"d":"317.8"},{"v":503.368338125481,"d":"503.4"},{"v":358.499096964775,"d":"358.5"},{"v":547.702634022876,"d":"547.7"},{"v":404.052273480739,"d":"404.1"},{"v":360.450328206166,"d":"360.5"},{"v":360.53915231144,"d":"360.5"},{"v":311.928106672368,"d":"311.9"},{"v":311.936218181694,"d":"311.9"},{"v":451.276534862479,"d":"451.3"},{"v":236.84145921577,"d":"236.8"},{"v":360.53915231144,"d":"360.5"},{"v":386.2646983097747,"d":"386.3"},{"v":89.03398607735663,"d":"89.0"},{"v":0.23049993040252822,"d":"0.2"},{"v":236.84145921577,"d":"236.8"},{"v":547.702634022876,"d":"547.7"},{"v":0.8622119756319246,"d":"86%"},{"v":317.846935983284,"d":"317.8"},{"v":451.276534862479,"d":"451.3"},{"v":102.9404781430768,"d":"102.9"},"EMERGING 1","EXIO Hybrid"]
["SE",{"v":20,"d":"20.0"},42.5,{"v":17.2486662524726,"d":"17.2"},{"v":27.4908864415033,"d":"27.5"},{"v":11.9711829405521,"d":"12.0"},{"v":10.4414360915688,"d":"10.4"},{"v":44.2920429839283,"d":"44.3"},{"v":9.45708074571106,"d":"9.5"},{"v":8.70019714607922,"d":"8.7"},{"v":48.3266621156975,"d":"48.3"},{"v":48.325479431712,"d":"48.3"},{"v":38.4258063984112,"d":"38.4"},{"v":16.2430064156887,"d":"16.2"},{"v":20,"d":"20.0"},{"v":26.417111304871135,"d":"26.4"},{"v":15.752592628139908,"d":"15.8"},{"v":0.5963026178882487,"d":"0.6"},{"v":8.70019714607922,"d":"8.7"},{"v":48.3266621156975,"d":"48.3"},{"v":1.9813232484809142,"d":"198%"},{"v":11.9711829405521,"d":"12.0"},42.5,{"v":30.911253771693723,"d":"30.9"},"EXIOBASE 3.10 pxp","GLORIA 0.6 act"]
["SI",{"v":327,"d":"327.0"},{"v":318,"d":"318.0"},{"v":259.250302451453,"d":"259.3"},{"v":249.585651854157,"d":"249.6"},{"v":302.363279773629,"d":"302.4"},{"v":383.77248882799,"d":"383.8"},{"v":416.410484952529,"d":"416.4"},{"v":217.939370803758,"d":"217.9"},{"v":152.765708036443,"d":"152.8"},{"v":211.220001007257,"d":"211.2"},{"v":211.217278405767,"d":"211.2"},{"v":433.734321920422,"d":"433.7"},{"v":252.669243473345,"d":"252.7"},{"v":259.250302451453,"d":"259.3"},{"v":287.3790870389808,"d":"287.4"},{"v":85.66428485766123,"d":"85.7"},{"v":0.2980880959025439,"d":"0.3"},{"v":152.765708036443,"d":"152.8"},{"v":433.734321920422,"d":"433.7"},{"v":1.083773523992679,"d":"108%"},{"v":217.939370803758,"d":"217.9"},{"v":327,"d":"327.0"},{"v":110.74047164536725,"d":"110.7"},"EXIOBASE 3.10 pxp","GTAP 11"]
["SK",{"v":234,"d":"234.0"},{"v":183,"d":"183.0"},{"v":133.473394474002,"d":"133.5"},{"v":397.299222229891,"d":"397.3"},{"v":147.152045966486,"d":"147.2"},{"v":272.577197423538,"d":"272.6"},{"v":163.426657307657,"d":"163.4"},{"v":167.994764763377,"d":"168.0"},{"v":107.649933074196,"d":"107.6"},{"v":238.949306871507,"d":"238.9"},{"v":238.950351950244,"d":"239.0"},{"v":350.908639375778,"d":"350.9"},{"v":153.465821819087,"d":"153.5"},{"v":183,"d":"183.0"},{"v":214.52671809659716,"d":"214.5"},{"v":86.10957220485862,"d":"86.1"},{"v":0.40139322956539697,"d":"0.4"},{"v":107.649933074196,"d":"107.6"},{"v":397.299222229891,"d":"397.3"},{"v":1.5827830008507924,"d":"158%"},{"v":153.465821819087,"d":"153.5"},{"v":238.950351950244,"d":"239.0"},{"v":79.59234747787974,"d":"79.6"},"EXIOBASE 3.10 pxp","JRC"]
["US",{"v":468,"d":"468.0"},{"v":469,"d":"469.0"},{"v":423.825490561322,"d":"423.8"},null,{"v":473.878803046379,"d":"473.9"},{"v":842.675452154893,"d":"842.7"},{"v":362.401025025516,"d":"362.4"},{"v":464.423931318938,"d":"464.4"},{"v":434.205925952575,"d":"434.2"},{"v":412.990008042621,"d":"413.0"},{"v":412.99734901953,"d":"413.0"},{"v":494.159117966731,"d":"494.2"},{"v":405.811961948441,"d":"405.8"},{"v":449.3149286357565,"d":"449.3"},{"v":472.0307554197456,"d":"472.0"},{"v":122.50517308890143,"d":"122.5"},{"v":0.2595279474532665,"d":"0.3"},{"v":362.401025025516,"d":"362.4"},{"v":842.675452154893,"d":"842.7"},{"v":1.0689037833388313,"d":"107%"},{"v":412.99551377530275,"d":"413.0"},{"v":470.21970076159477,"d":"470.2"},{"v":51.808280971168756,"d":"51.8"},"EORA 199.82","EXIO Hybrid"]

{"sheet":"Stat analysis LCCI 2023","index":10,"n_rows":30,"n_cols":20,"rows_kept":30,"merged":[[0,8,0,17],[0,18,0,19]]}
[null,"Physical","Physical","Physical","Hybrid","Monetary","Monetary","Monetary","Stats",{"$nulls":9},"Sources comparison"]
["Paese","Electricity Maps","IPCC","NREL","EXIO Hybrid","GLORIA 0.6 act","GLORIA 0.6 com","EMERGING 2","Median","Mean","Standard dev","CV%","Min","Max","Relative \ndispersion%","Q1","Q2","IQR","Source min","Source max"]
["AT",{"v":76,"d":"76.0"},{"v":81.0170509551661,"d":"81.0"},{"v":72.5381567452344,"d":"72.5"},{"v":273.62806176137,"d":"273.6"},{"v":292.822162954947,"d":"292.8"},{"v":292.828107511366,"d":"292.8"},{"$f":"VLOOKUP(A3,[1]physical_efs!$H$254:$J$281,3,FALSE)","v":{"v":448.12948866675,"d":"448.1"}},{"$f":"MEDIAN(B3:H3)","v":{"v":273.62806176137,"d":"273.6"}},{"$f":"AVERAGE(B3:H3)","v":{"v":219.56614694211905,"d":"219.6"}},{"$f":"_xlfn.STDEV.P(B3:H3)","v":{"v":134.86605577954492,"d":"134.9"}},{"$f":"K3/J3","v":{"v":0.6142388417240735,"d":"0.6"}},{"$f":"MIN(B3:H3)","v":{"v":72.5381567452344,"d":"72.5"}},{"$f":"MAX(B3:H3)","v":{"v":448.12948866675,"d":"448.1"}},{"$f":"(N3-M3)/I3","v":{"v":1.3726345518211773,"d":"137%"}},{"$f":"_xlfn.QUARTILE.EXC(B3:H3,1)","v":{"v":76,"d":"76.0"}},{"$f":"_xlfn.QUARTILE.EXC(B3:H3,2)","v":{"v":273.62806176137,"d":"273.6"}},{"$f":"_xlfn.QUARTILE.EXC(B3:H3,3)","v":{"v":292.828107511366,"d":"292.8"}},{"$f":"INDEX($B$2:$H$2,MATCH(M3,B3:H3,0))","v":"NREL"},{"$f":"INDEX($B$2:$H$2,MATCH(N3,B3:H3,0))","v":"EMERGING 2"}]
["BE",{"v":171,"d":"171.0"},{"v":124.021350137246,"d":"124.0"},{"v":125.392651827565,"d":"125.4"},{"v":250.158925542331,"d":"250.2"},{"v":191.24553748733,"d":"191.2"},{"v":191.243489566277,"d":"191.2"},{"$f":"VLOOKUP(A4,[1]physical_efs!$H$254:$J$281,3,FALSE)","v":{"v":246.935554001515,"d":"246.9"}},{"$f":"MEDIAN(B4:H4)","v":{"v":191.243489566277,"d":"191.2"}},{"$f":"AVERAGE(B4:H4)","v":{"v":185.71392979460913,"d":"185.7"}},{"$f":"_xlfn.STDEV.P(B4:H4)","v":{"v":47.243367112293114,"d":"47.2"}},{"$f":"K4/J4","v":{"v":0.2543878489057986,"d":"0.3"}},{"$f":"MIN(B4:H4)","v":{"v":124.021350137246,"d":"124.0"}},{"$f":"MAX(B4:H4)","v":{"v":250.158925542331,"d":"250.2"}},{"$f":"(N4-M4)/I4","v":{"v":0.6595653305174134,"d":"66%"}},{"$f":"_xlfn.QUARTILE.EXC(B4:H4,1)","v":{"v":125.392651827565,"d":"125.4"}},{"$f":"_xlfn.QUARTILE.EXC(B4:H4,2)","v":{"v":191.243489566277,"d":"191.2"}},{"$f":"_xlfn.QUARTILE.EXC(B4:H4,3)","v":{"v":246.935554001515,"d":"246.9"}},{"$f":"INDEX($B$2:$H$2,MATCH(M4,B4:H4,0))","v":"IPCC"},{"$f":"INDEX($B$2:$H$2,MATCH(N4,B4:H4,0))","v":"EXIO Hybrid"}]
["BG",{"v":412,"d":"412.0"},{"v":316.456032872067,"d":"316.5"},{"v":371.443265106922,"d":"371.4"},{"v":615.064984616681,"d":"615.1"},{"v":472.234980473345,"d":"472.2"},{"v":472.233718150969,"d":"472.2"},{"$f":"VLOOKUP(A5,[1]physical_efs!$H$254:$J$281,3,FALSE)","v":{"v":285.670410104918,"d":"285.7"}},{"v":412,"d":"412.0"},{"v":420.7290559035574,"d":"420.7"},{"v":103.2964045953653,"d":"103.3"},{"v":0.24551763931189877,"d":"0.2"},{"v":285.670410104918,"d":"285.7"},{"v":615.064984616681,"d":"615.1"},{"v":0.7995013944460267,"d":"80%"},{"v":316.456032872067,"d":"316.5"},{"v":412,"d":"412.0"},{"v":472.234980473345,"d":"472.2"},"EMERGING 2","EXIO Hybrid"]
["CY",{"v":831,"d":"831.0"},{"$nulls":3},{"v":1341.32764805718,"d":"1,341.3"},{"v":1341.33377291556,"d":"1,341.3"},{"$f":"VLOOKUP(A6,[1]physical_efs!$H$254:$J$281,3,FALSE)","v":{"v":316.484101334841,"d":"316.5"}},{"v":1086.1638240285902,"d":"1,086.2"},{"v":957.5363805768953,"d":"957.5"},{"v":424.72216085666406,"d":"424.7"},{"v":0.44355720521112524,"d":"0.4"},{"v":316.484101334841,"d":"316.5"},{"v":1341.33377291556,"d":"1341.3"},{"v":0.9435498116476976,"d":"94%"},{"v":445.11307600113076,"d":"445.1"},{"v":1086.1638240285902,"d":"1,086.2"},{"v":1341.3322417009651,"d":"1,341.3"},"EMERGING 2","GLORIA 0.6 com"]
["CZ",{"v":506,"d":"506.0"},{"v":365.005967610506,"d":"365.0"},{"v":428.498229964196,"d":"428.5"},{"v":941.033657439325,"d":"941.0"},{"v":597.612384806749,"d":"597.6"},{"v":597.606871262011,"d":"597.6"},{"$f":"VLOOKUP(A7,[1]physical_efs!$H$254:$J$281,3,FALSE)","v":{"v":1122.94672172329,"d":"1,122.9"}},{"v":597.606871262011,"d":"597.6"},{"v":651.2434046865825,"d":"651.2"},{"v":257.703734591273,"d":"257.7"},{"v":0.39571031773488063,"d":"0.4"},{"v":365.005967610506,"d":"365.0"},{"v":1122.94672172329,"d":"1122.9"},{"v":1.2682932385167927,"d":"127%"},{"v":428.498229964196,"d":"428.5"},{"v":597.606871262011,"d":"597.6"},{"v":941.033657439325,"d":"941.0"},"IPCC","EMERGING 2"]
["DE",{"v":405,"d":"405.0"},{"v":314.53325715066,"d":"314.5"},{"v":359.283552095016,"d":"359.3"},{"v":570.279389786437,"d":"570.3"},{"v":224.004497025918,"d":"224.0"},{"v":224.00887223549,"d":"224.0"},{"$f":"VLOOKUP(A8,[1]physical_efs!$H$254:$J$281,3,FALSE)","v":{"v":250.933290558624,"d":"250.9"}},{"v":314.53325715066,"d":"314.5"},{"v":335.434694121735,"d":"335.4"},{"v":115.24501276463262,"d":"115.2"},{"v":0.3435691500736898,"d":"0.3"},{"v":224.004497025918,"d":"224.0"},{"v":570.279389786437,"d":"570.3"},{"v":1.1009166276959226,"d":"110%"},{"v":224.00887223549,"d":"224.0"},{"v":314.53325715066,"d":"314.5"},{"v":405,"d":"405.0"},"GLORIA 0.6 act","EXIO Hybrid"]
["DK",{"v":166,"d":"166.0"},{"v":163.073907932648,"d":"163.1"},{"v":181.851305801186,"d":"181.9"},{"v":282.308504203666,"d":"282.3"},{"v":138.872545927119,"d":"138.9"},{"v":138.87144351811,"d":"138.9"},{"$f":"VLOOKUP(A9,[1]physical_efs!$H$254:$J$281,3,FALSE)","v":{"v":202.015326674249,"d":"202.0"}},{"v":166,"d":"166.0"},{"v":181.85614772242545,"d":"181.9"},{"v":45.97597697716882,"d":"46.0"},{"v":0.2528150824317683,"d":"0.3"},{"v":138.87144351811,"d":"138.9"},{"v":282.308504203666,"d":"282.3"},{"v":0.8640786788286507,"d":"86%"},{"v":138.872545927119,"d":"138.9"},{"v":166,"d":"166.0"},{"v":202.015326674249,"d":"202.0"},"GLORIA 0.6 com","EXIO Hybrid"]
["EE",{"v":572,"d":"572.0"},{"v":504.358393063115,"d":"504.4"},{"v":522.64212880196,"d":"522.6"},{"v":853.892583389604,"d":"853.9"},{"v":435.411681288415,"d":"435.4"},{"v":435.404413892665,"d":"435.4"},{"$f":"VLOOKUP(A10,[1]physical_efs!$H$254:$J$281,3,FALSE)","v":{"v":425.772861930973,"d":"425.8"}},{"v":504.358393063115,"d":"504.4"},{"v":535.6402946238188,"d":"535.6"},{"v":139.3443405192919,"d":"139.3"},{"v":0.2601453660560651,"d":"0.3"},{"v":425.772861930973,"d":"425.8"},{"v":853.892583389604,"d":"853.9"},{"v":0.8488402837088437,"d":"85%"},{"v":435.404413892665,"d":"435.4"},{"v":504.358393063115,"d":"504.4"},{"v":572,"d":"572.0"},"EMERGING 2","EXIO Hybrid"]
["ES",{"v":155,"d":"155.0"},{"v":137.992177588802,"d":"138.0"},{"v":141.267723208824,"d":"141.3"},{"v":256.018588337569,"d":"256.0"},{"v":242.246879375699,"d":"242.2"},{"v":242.246529007677,"d":"242.2"},{"$f":"VLOOKUP(A11,[1]physical_efs!$H$254:$J$281,3,FALSE)","v":{"v":162.02855852245,"d":"162.0"}},{"v":162.02855852245,"d":"162.0"},{"v":190.97149372014584,"d":"191.0"},{"v":49.13295887565091,"d":"49.1"},{"v":0.2572790206461468,"d":"0.3"},{"v":137.992177588802,"d":"138.0"},{"v":256.018588337569,"d":"256.0"},{"v":0.7284296782311603,"d":"73%"},{"v":141.267723208824,"d":"141.3"},{"v":162.02855852245,"d":"162.0"},{"v":242.246879375699,"d":"242.2"},"IPCC","EXIO Hybrid"]
["FI",{"v":92,"d":"92.0"},{"v":76.4561811750075,"d":"76.5"},{"v":81.8745951936603,"d":"81.9"},{"v":227.223063277924,"d":"227.2"},{"v":136.642570165744,"d":"136.6"},{"v":136.639378203082,"d":"136.6"},{"$f":"VLOOKUP(A12,[1]physical_efs!$H$254:$J$281,3,FALSE)","v":{"v":96.2478436553363,"d":"96.2"}},{"v":96.2478436553363,"d":"96.2"},{"v":121.0119473815363,"d":"121.0"},{"v":48.90404112051626,"d":"48.9"},{"v":0.4041257262502158,"d":"0.4"},{"v":76.4561811750075,"d":"76.5"},{"v":227.223063277924,"d":"227.2"},{"v":1.566444258666334,"d":"157%"},{"v":81.8745951936603,"d":"81.9"},{"v":96.2478436553363,"d":"96.2"},{"v":136.642570165744,"d":"136.6"},"IPCC","EXIO Hybrid"]
["FR",{"v":42,"d":"42.0"},{"v":48.3793117402483,"d":"48.4"},{"v":48.4816500644346,"d":"48.5"},{"v":137.099994435193,"d":"137.1"},{"v":89.3429300242753,"d":"89.3"},{"v":89.3438784315,"d":"89.3"},{"$f":"VLOOKUP(A13,[1]physical_efs!$H$254:$J$281,3,FALSE)","v":{"v":138.867696204982,"d":"138.9"}},{"v":89.3429300242753,"d":"89.3"},{"v":84.78792298580473,"d":"84.8"},{"v":38.129887582947454,"d":"38.1"},{"v":0.4497089472203629,"d":"0.4"},{"v":42,"d":"42.0"},{"v":138.867696204982,"d":"138.9"},{"v":1.0842234094926386,"d":"108%"},{"v":48.3793117402483,"d":"48.4"},{"v":89.3429300242753,"d":"89.3"},{"v":137.099994435193,"d":"137.1"},"Electricity Maps","EMERGING 2"]
["GR",{"v":305,"d":"305.0"},{"v":279.360775732286,"d":"279.4"},{"v":297.605295904693,"d":"297.6"},{"v":470.117982923781,"d":"470.1"},{"v":463.631653709559,"d":"463.6"},{"v":463.621856065403,"d":"463.6"},{"$f":"VLOOKUP(A14,[1]physical_efs!$H$254:$J$281,3,FALSE)","v":{"v":725.504092297745,"d":"725.5"}},{"v":463.621856065403,"d":"463.6"},{"v":429.263093804781,"d":"429.3"},{"v":144.931200821231,"d":"144.9"},{"v":0.33762790911427004,"d":"0.3"},{"v":279.360775732286,"d":"279.4"},{"v":725.504092297745,"d":"725.5"},{"v":0.9623000096495057,"d":"96%"},{"v":297.605295904693,"d":"297.6"},{"v":463.621856065403,"d":"463.6"},{"v":470.117982923781,"d":"470.1"},"IPCC","EMERGING 2"]
["HR",{"v":238,"d":"238.0"},{"v":186.131632290255,"d":"186.1"},{"v":189.759188268169,"d":"189.8"},{"v":314.715489682328,"d":"314.7"},{"v":256.517236920299,"d":"256.5"},{"v":256.516965178287,"d":"256.5"},{"$f":"VLOOKUP(A15,[1]physical_efs!$H$254:$J$281,3,FALSE)","v":{"v":263.333071183856,"d":"263.3"}},{"v":256.516965178287,"d":"256.5"},{"v":243.5676547890277,"d":"243.6"},{"v":41.426887303939225,"d":"41.4"},{"v":0.17008369744259422,"d":"0.2"},{"v":186.131632290255,"d":"186.1"},{"v":314.715489682328,"d":"314.7"},{"v":0.5012684338546705,"d":"50%"},{"v":189.759188268169,"d":"189.8"},{"v":256.516965178287,"d":"256.5"},{"v":263.333071183856,"d":"263.3"},"IPCC","EXIO Hybrid"]
["HU",{"v":246,"d":"246.0"},{"v":195.520482820605,"d":"195.5"},{"v":211.645648602126,"d":"211.6"},{"v":335.344988369317,"d":"335.3"},{"v":308.246320945494,"d":"308.2"},{"v":308.24528904345,"d":"308.2"},{"$f":"VLOOKUP(A16,[1]physical_efs!$H$254:$J$281,3,FALSE)","v":{"v":413.52287529585,"d":"413.5"}},{"v":308.24528904345,"d":"308.2"},{"v":288.3608007252632,"d":"288.4"},{"v":70.67315334035926,"d":"70.7"},{"v":0.24508585481316295,"d":"0.2"},{"v":195.520482820605,"d":"195.5"},{"v":413.52287529585,"d":"413.5"},{"v":0.7072367371834045,"d":"71%"},{"v":211.645648602126,"d":"211.6"},{"v":308.24528904345,"d":"308.2"},{"v":335.344988369317,"d":"335.3"},"IPCC","EMERGING 2"]
["IE",{"v":415,"d":"415.0"},{"v":303.067581774199,"d":"303.1"},{"v":313.122165557157,"d":"313.1"},{"v":521.606550054997,"d":"521.6"},{"v":499.609375060548,"d":"499.6"},{"v":499.610692003584,"d":"499.6"},{"$f":"VLOOKUP(A17,[1]physical_efs!$H$254:$J$281,3,FALSE)","v":{"v":423.828762666881,"d":"423.8"}},{"v":423.828762666881,"d":"423.8"},{"v":425.12073244533804,"d":"425.1"},{"v":82.76608513355691,"d":"82.8"},{"v":0.19468842335088649,"d":"0.2"},{"v":303.067581774199,"d":"303.1"},{"v":521.606550054997,"d":"521.6"},{"v":0.5156303383132217,"d":"52%"},{"v":313.122165557157,"d":"313.1"},{"v":423.828762666881,"d":"423.8"},{"v":499.610692003584,"d":"499.6"},"IPCC","EXIO Hybrid"]
["IT",{"v":362,"d":"362.0"},{"v":310.139292023355,"d":"310.1"},{"v":320.815396112822,"d":"320.8"},{"v":698.124704129782,"d":"698.1"},{"v":382.862550335194,"d":"382.9"},{"v":382.863709541752,"d":"382.9"},{"$f":"VLOOKUP(A18,[1]physical_efs!$H$254:$J$281,3,FALSE)","v":{"v":330.662359467271,"d":"330.7"}},{"v":362,"d":"362.0"},{"v":398.2097159443109,"d":"398.2"},{"v":125.3794838256082,"d":"125.4"},{"v":0.3148579223595397,"d":"0.3"},{"v":310.139292023355,"d":"310.1"},{"v":698.124704129782,"d":"698.1"},{"v":1.0717829063713453,"d":"107%"},{"v":320.815396112822,"d":"320.8"},{"v":362,"d":"362.0"},{"v":382.863709541752,"d":"382.9"},"IPCC","EXIO Hybrid"]
["LT",{"v":127,"d":"127.0"},{"v":101.539917128757,"d":"101.5"},{"v":101.620350774504,"d":"101.6"},{"v":193.150151266549,"d":"193.2"},{"v":99.6211446315857,"d":"99.6"},{"v":99.6201837887584,"d":"99.6"},{"$f":"VLOOKUP(A19,[1]physical_efs!$H$254:$J$281,3,FALSE)","v":{"v":134.607361325217,"d":"134.6"}},{"v":101.620350774504,"d":"101.6"},{"v":122.45130127362442,"d":"122.5"},{"v":31.804039073816927,"d":"31.8"},{"v":0.2597280612212441,"d":"0.3"},{"v":99.6201837887584,"d":"99.6"},{"v":193.150151266549,"d":"193.2"},{"v":0.9203861900194971,"d":"92%"},{"v":99.6211446315857,"d":"99.6"},{"v":101.620350774504,"d":"101.6"},{"v":134.607361325217,"d":"134.6"},"GLORIA 0.6 com","EXIO Hybrid"]
["LU",{"$nulls":4},{"v":48.9739670092306,"d":"49.0"},{"v":48.9736412106762,"d":"49.0"},{"$f":"VLOOKUP(A20,[1]physical_efs!$H$254:$J$281,3,FALSE)","v":{"v":405.71621537847,"d":"405.7"}},{"v":48.9739670092306,"d":"49.0"},{"v":167.88794119945894,"d":"167.9"},{"v":168.1699854299248,"d":"168.2"},{"v":1.001679955263319,"d":"1.0"},{"v":48.9736412106762,"d":"49.0"},{"v":405.71621537847,"d":"405.7"},{"v":7.284330756798915,"d":"728%"},{"v":48.9736412106762,"d":"49.0"},{"v":48.9739670092306,"d":"49.0"},{"v":405.71621537847,"d":"405.7"},"GLORIA 0.6 com","EMERGING 2"]
["LV",{"v":157,"d":"157.0"},{"v":145.545742355988,"d":"145.5"},{"v":135.746375304411,"d":"135.7"},{"v":271.849912924009,"d":"271.8"},{"v":121.371295081844,"d":"121.4"},{"v":121.370494961625,"d":"121.4"},{"$f":"VLOOKUP(A21,[1]physical_efs!$H$254:$J$281,3,FALSE)","v":{"v":514.184986705625,"d":"514.2"}},{"v":145.545742355988,"d":"145.5"},{"v":209.58125819050028,"d":"209.6"},{"v":133.38444922242007,"d":"133.4"},{"v":0.6364330969956263,"d":"0.6"},{"v":121.370494961625,"d":"121.4"},{"v":514.184986705625,"d":"514.2"},{"v":2.698907473247972,"d":"270%"},{"v":121.371295081844,"d":"121.4"},{"v":145.545742355988,"d":"145.5"},{"v":271.849912924009,"d":"271.8"},"GLORIA 0.6 com","EMERGING 2"]
["MT",{"$nulls":4},{"v":328.03321029708,"d":"328.0"},{"v":328.028206385341,"d":"328.0"},{"$f":"VLOOKUP(A22,[1]physical_efs!$H$254:$J$281,3,FALSE)","v":{"v":478.712207946461,"d":"478.7"}},{"v":328.03321029708,"d":"328.0"},{"v":378.25787487629395,"d":"378.3"},{"v":71.03194014286284,"d":"71.0"},{"v":0.18778707559252594,"d":"0.2"},{"v":328.028206385341,"d":"328.0"},{"v":478.712207946461,"d":"478.7"},{"v":0.45935593357957427,"d":"46%"},{"v":328.028206385341,"d":"328.0"},{"v":328.03321029708,"d":"328.0"},{"v":478.712207946461,"d":"478.7"},"GLORIA 0.6 com","EMERGING 2"]
["NL",{"v":288,"d":"288.0"},{"v":369.895494394396,"d":"369.9"},{"v":396.041034269499,"d":"396.0"},{"v":427.61164928071,"d":"427.6"},{"v":402.258724823595,"d":"402.3"},{"v":402.258202685816,"d":"402.3"},{"$f":"VLOOKUP(A23,[1]physical_efs!$H$254:$J$281,3,FALSE)","v":{"v":275.900512885812,"d":"275.9"}},{"v":396.041034269499,"d":"396.0"},{"v":365.99508833426114,"d":"366.0"},{"v":55.47831460625554,"d":"55.5"},{"v":0.151582128762306,"d":"0.2"},{"v":275.900512885812,"d":"275.9"},{"v":427.61164928071,"d":"427.6"},{"v":0.38306923593089404,"d":"38%"},{"v":288,"d":"288.0"},{"v":396.041034269499,"d":"396.0"},{"v":402.258724823595,"d":"402.3"},"EMERGING 2","EXIO Hybrid"]
["PL",{"v":777,"d":"777.0"},{"v":582.420324203381,"d":"582.4"},{"v":684.989640253321,"d":"685.0"},{"v":1359.36758225423,"d":"1,359.4"},{"v":797.062879841522,"d":"797.1"},{"v":797.05990030264,"d":"797.1"},{"$f":"VLOOKUP(A24,[1]physical_efs!$H$254:$J$281,3,FALSE)","v":{"v":837.013177837507,"d":"837.0"}},{"v":797.05990030264,"d":"797.1"},{"v":833.559072098943,"d":"833.6"},{"v":229.12665156429387,"d":"229.1"},{"v":0.2748775212623403,"d":"0.3"},{"v":582.420324203381,"d":"582.4"},{"v":1359.36758225423,"d":"1359.4"},{"v":0.9747664607839959,"d":"97%"},{"v":684.989640253321,"d":"685.0"},{"v":797.05990030264,"d":"797.1"},{"v":837.013177837507,"d":"837.0"},"IPCC","EXIO Hybrid"]
["PT",{"v":152,"d":"152.0"},{"v":138.715667299879,"d":"138.7"},{"v":135.264740483313,"d":"135.3"},{"v":218.322105573008,"d":"218.3"},{"v":308.543731679273,"d":"308.5"},{"v":308.534142768061,"d":"308.5"},{"$f":"VLOOKUP(A25,[1]physical_efs!$H$254:$J$281,3,FALSE)","v":{"v":228.554710586902,"d":"228.6"}},{"v":218.322105573008,"d":"218.3"},{"v":212.84787119863373,"d":"212.8"},{"v":69.49555132876716,"d":"69.5"},{"v":0.32650338919252136,"d":"0.3"},{"v":135.264740483313,"d":"135.3"},{"v":308.543731679273,"d":"308.5"},{"v":0.7936850496250578,"d":"79%"},{"v":138.715667299879,"d":"138.7"},{"v":218.322105573008,"d":"218.3"},{"v":308.534142768061,"d":"308.5"},"NREL","GLORIA 0.6 act"]
["RO",{"v":280,"d":"280.0"},{"v":215.202753623234,"d":"215.2"},{"v":234.180405033561,"d":"234.2"},{"v":385.312036382449,"d":"385.3"},{"v":125.427586771869,"d":"125.4"},{"v":125.427475313807,"d":"125.4"},{"$f":"VLOOKUP(A26,[1]physical_efs!$H$254:$J$281,3,FALSE)","v":{"v":1083.7800292537,"d":"1,083.8"}},{"v":234.180405033561,"d":"234.2"},{"v":349.9043266255172,"d":"349.9"},{"v":310.9961118285334,"d":"311.0"},{"v":0.8888032761063139,"d":"0.9"},{"v":125.427475313807,"d":"125.4"},{"v":1083.7800292537,"d":"1083.8"},{"v":4.092368675349029,"d":"409%"},{"v":125.427586771869,"d":"125.4"},{"v":234.180405033561,"d":"234.2"},{"v":385.312036382449,"d":"385.3"},"GLORIA 0.6 com","EMERGING 2"]
["SE",{"v":21,"d":"21.0"},{"v":17.2552505568691,"d":"17.3"},{"v":12.2489047497128,"d":"12.2"},{"v":12.6965044299895,"d":"12.7"},{"v":37.7494964159056,"d":"37.7"},{"v":37.7501483425881,"d":"37.8"},{"$f":"VLOOKUP(A27,[1]physical_efs!$H$254:$J$281,3,FALSE)","v":{"v":23.1640561597408,"d":"23.2"}},{"v":21,"d":"21.0"},{"v":23.123480093543698,"d":"23.1"},{"v":9.95550759232964,"d":"10.0"},{"v":0.4305367337466351,"d":"0.4"},{"v":12.2489047497128,"d":"12.2"},{"v":37.7501483425881,"d":"37.8"},{"v":1.2143449329940619,"d":"121%"},{"v":12.6965044299895,"d":"12.7"},{"v":21,"d":"21.0"},{"v":37.7494964159056,"d":"37.7"},"NREL","GLORIA 0.6 com"]
["SI",{"v":251,"d":"251.0"},{"v":195.364065827288,"d":"195.4"},{"v":223.489498914186,"d":"223.5"},{"v":292.256517188104,"d":"292.3"},{"v":259.346665335924,"d":"259.3"},{"v":259.342586311511,"d":"259.3"},{"$f":"VLOOKUP(A28,[1]physical_efs!$H$254:$J$281,3,FALSE)","v":{"v":522.049101758678,"d":"522.0"}},{"v":259.342586311511,"d":"259.3"},{"v":286.12120504795587,"d":"286.1"},{"v":100.37548994820301,"d":"100.4"},{"v":0.35081457849787606,"d":"0.4"},{"v":195.364065827288,"d":"195.4"},{"v":522.049101758678,"d":"522.0"},{"v":1.2596659907562973,"d":"126%"},{"v":223.489498914186,"d":"223.5"},{"v":259.342586311511,"d":"259.3"},{"v":292.256517188104,"d":"292.3"},"IPCC","EMERGING 2"]
["SK",{"v":139,"d":"139.0"},{"v":95.935674158851,"d":"95.9"},{"v":99.7096079499649,"d":"99.7"},{"v":199.824138668413,"d":"199.8"},{"v":312.528072909297,"d":"312.5"},{"v":312.515116053794,"d":"312.5"},{"$f":"VLOOKUP(A29,[1]physical_efs!$H$254:$J$281,3,FALSE)","v":{"v":511.734308536139,"d":"511.7"}},{"v":199.824138668413,"d":"199.8"},{"v":238.7495597537798,"d":"238.7"},{"v":139.69271203074462,"d":"139.7"},{"v":0.5851014434322241,"d":"0.6"},{"v":95.935674158851,"d":"95.9"},{"v":511.734308536139,"d":"511.7"},{"v":2.080822853275308,"d":"208%"},{"v":99.7096079499649,"d":"99.7"},{"v":199.824138668413,"d":"199.8"},{"v":312.528072909297,"d":"312.5"},"IPCC","EMERGING 2"]
["US",{"v":421,"d":"421.0"},{"v":359.519611010563,"d":"359.5"},{"v":385.614956393199,"d":"385.6"},{"v":643.929466864971,"d":"643.9"},{"v":649.695461750231,"d":"649.7"},{"v":649.686032075205,"d":"649.7"},{"$f":"VLOOKUP(A30,[1]physical_efs!$H$254:$J$281,3,FALSE)","v":{"v":643.670115394854,"d":"643.7"}},{"v":643.670115394854,"d":"643.7"},{"v":536.159377641289,"d":"536.2"},{"v":128.77367006183215,"d":"128.8"},{"v":0.24017796840249736,"d":"0.2"},{"v":359.519611010563,"d":"359.5"},{"v":649.695461750231,"d":"649.7"},{"v":0.45081454583558234,"d":"45%"},{"v":385.614956393199,"d":"385.6"},{"v":643.670115394854,"d":"643.7"},{"v":649.686032075205,"d":"649.7"},"IPCC","GLORIA 0.6 act"]

{"sheet":"Data Sources' Details","index":11,"n_rows":19,"n_cols":12,"rows_kept":19,"merged":[[2,0,3,0],[2,1,3,1],[2,2,3,2],[2,3,3,3],[2,4,3,4],[2,5,3,5],[2,6,3,6],[2,7,3,7],[2,9,3,9],[2,10,3,10],[2,11,3,11],[4,0,5,0],[4,2,5,2],[4,3,5,3],[4,5,5,5],[4,6,5,6],[4,9,5,9],[4,10,5,10],[4,11,5,11],[9,0,10,0],[9,2,10,2],[9,3,10,3],[9,4,10,4],[9,5,10,5],[9,6,10,6],[9,7,10,7],[9,8,10,8],[9,9,10,9],[9,10,10,10],[9,11,10,11],[13,0,14,0],[13,2,14,2],[13,3,14,3],[13,4,14,4],[13,5,14,5],[13,6,14,6],[13,7,14,7],[13,8,14,8],[13,9,14,9],[13,10,14,10],[13,11,14,11]]}
["Data source and publication year (or version)","Acronym","Available data years","Available regional detail","Carbon intensities analyzed","GHGs included","Electricity generation technologies","Handling co-products","Unit type","Database type","Reference","Prices"]
["EXIOBASE Hybrid SUT v3.3.18","EXIO Hybrid",2011,"AT, BE, BG, CY, CZ, DE, DK, EE, ES, FI, FR, GR, HR, HU, IE, IT, LT, LU, LV, MT, NL, PL, PT, RO, SE, SI, SK, GB, US, JP, CN, CA, KR, BR, IN, MX, RU, AU, CH, TR, NO, ID, ZA, RoW Asia and Pacific, RoW America, RoW Europe, RoW Africa, RoW Middle East","Direct CI, Life-Cycle CI","CO2, N2O, CH4, SF6, HFCs","Production of electricity by coal, Production of electricity by biomass and waste, Production of electricity by Geothermal, Production of electricity by hydro, Production of electricity by gas, Production of electricity nec, Production of electricity by nuclear, Production of electricity by petroleum and other oil derivatives, Production of electricity by solar photovoltaic; Production of electricity by solar thermal, Production of electricity by tide, wave, ocean, Production of electricity by wind","Industry-based","Physical","EEIOT","(Stadler et al., 2021a)","NA"]
["Ecoinvent v3.4 via Steubing et al. ","Ecoinvent",null,"216 regions (sub-regions, nations, clusters), but geographical information removed for this study for licenced data (following Steubing et al., 2022)","Life-Cycle CI","CO2, N2O, CH4, SF6, HFCs","Coal, Biomass, Waste, Geothermal, Hydroelectric, Natural Gas, Industrial gasses, Nuclear, Petroleum products, Photovoltaics, Wind","Cut-off ",null,"P-LCA","(“Ecoinvent,” 2025; Steubing et al., 2022)","NA"]
[{"$nulls":8},"Physical"]
["IEA emission factors per plant 2024","IEA (CHP)","1990-2023","AL, DZ, AO, AR, AM, AU, AT, AZ, BH, BD, BY, BE, BJ, BO, BA, BW, BR, BN, BG, KH, CM, CA, CL, CN, CO, CG, CD, CR, CI, HR, CU, CW, CY, CZ, DK, DO, EC, EG, SV, GQ, ER, EE, ET, SZ, FI, FR, GA, GE, DE, GH, GI, GR, GT, GY, HT, HN, HK, HU, IS, IN, ID, IR, IQ, IE, IL, IT, JM, JP, JO, KZ, KE, KR, KP, XK, KW, KG, LA, LV, LB, LY, LT, LU, MG, MY, MT, MU, MX, MD, MN, ME, MA, MZ, MM, NA, NP, NL, NZ, NI, NE, NG, MK, NO, OM, PK, PA, PY, PE, PH, PL, PT, QA, RO, RU, RW, SA, SN, RS, SG, SK, SI, ZA, ES, LK, SS, SD, SR, SE, CH, SY, TW, TJ, TZ, TH, TG, TT, TN, TR, TM, AE, UG, GB, UA, UY, US, UZ, VE, VN, YE, ZM, ZW, World, OECD Total, OECD Americas, OECD Asia Oceania, OECD Europe, Africa, Non-OECD Americas, Middle East, Non-OECD Europe and Eurasia, Non-OECD Asia (excluding China), China (PR of China and Hong Kong China) ","Life-Cycle CI","CO2, N2O, CH4","Coal peat and oil shale, Non-renewable wastes, Natural gas, Oil","Electricity and heat CHP/","Physical","Primary data","(IEA, 2024b)","NA"]
[null,"IEA (ele)",{"$nulls":5},"Electricity output only"]
["Electricity Maps 2025","Electricity Maps",null,"AD, AE, AF, AG, AL, AM, AO, AR, AT, AU, AW, AX, AZ, BA, BB, BD, BE, BF, BG, BH, BI, BJ, BN, BO, BR, BS, BT, BW, BY, BZ, CD, CF, CG, CH, CI, CM, CN, CO, CR, CU, CV, CY, CZ, DE, DJ, DK, DM, DO, DZ, EC, EE, EG, EH, ER, ES, ET, FI, FJ, FK, FM, FO, FR, GA, GB, GE, GF, GG, GH, GI, GL, GM, GN, GP, GQ, GR, GS, GT, GU, GW, GY, HK, HM, HN, HR, HT, HU, ID, IE, IL, IM, IN, IQ, IR, IS, IT, JE, JM, JO, JP, KE, KG, KH, KM, KP, KR, KW, KZ, LA, LB, LC, LI, LK, LR, LS, LT, LU, LV, LY, MA, MD, ME, MG, MK, ML, MM, MN, MQ, MR, MT, MU, MW, MX, MY, MZ, NA, NC, NE, NG, NI, NL, NO, NP, NZ, OM, PA, PE, PF, PG, PH, PK, PL, PM, PR, PS, PT, PW, PY, QA, RE, RO, RS, RU, RW, SA, SB, SD, SE, SG, SI, SJ, SK, SL, SN, SO, SR, SS, ST, SV, SY, SZ, TD, TF, TG, TH, TJ, TL, TM, TN, TO, TR, TT, TW, TZ, UA, UG, US, UY, UZ, VC, VE, VI, VN, VU, WS, XK, XX, YE, YT, ZA, ZM, ZW (and sub-regions)","Direct CI, Life-Cycle CI","Generic CO2-eq","Coal, Biomass, Geothermal, Hydro, Gas, Unknown, Oil, Solar, Wind",null,"Physical","Secondary data","(Electricity Maps, 2024)","NA"]
["NREL harmonization 2021","NREL",null,"x","Life-Cycle CI","Generic CO2-eq","Coal, Natural gas, Nuclear, Solar photovoltaics, Concentrating solar power, Wind",null,"Physical","Secondary data","(National Renewable Energy Laboratory, 2021)","NA"]
["IPCC AR5 WG3 (Annex III)","IPCC",null,"x","Direct CI, Life-Cycle CI","Generic CO2-eq","Coal, Biomass dedicated, Geothermal, Hydropower, Gas - Combined Cycle, Nuclear, Solar PV – Utility, Concentrated solar power, Ocean - Wave & Tidal, Wind",null,"Physical","Secondary data","(Schlömer et al., 2014)","NA"]
["EXIOBASE IOT ixi/pxp v3.10.2","EXIO ixi","1995-2024","AT, BE, BG, CY, CZ, DE, DK, EE, ES, FI, FR, GR, HR, HU, IE, IT, LT, LU, LV, MT, NL, PL, PT, RO, SE, SI, SK, GB, US, JP, CN, CA, KR, BR, IN, MX, RU, AU, CH, TR,TW, NO, ID, ZA, RoW Asia and Pacific, RoW America, RoW Europe, RoW Africa, RoW Middle East","Direct CI, Life-Cycle CI","CO2, N2O, CH4, SF6, HFCs","Production of electricity by coal, Production of electricity by biomass and waste, Production of electricity by Geothermal, Production of electricity by hydro, Production of electricity by gas, Production of electricity nec, Production of electricity by nuclear, Production of electricity by petroleum and other oil derivatives, Production of electricity by solar photovoltaic; Production of electricity by solar thermal, Production of electricity by tide, wave, ocean, Production of electricity by wind","Industry-based","Monetary","EEIOT","(Stadler et al., 2025)","Basic"]
[null,"EXIO pxp"]
["EMERGING v2.2","EMERGING","2015, 2018, 2021, 2023","AW, AF, AO, AI, AL, AD, AN, BQ, CW, AE, AR, AM, AS, AQ, TF, AG, AU, AT, AZ, BI, BE, BJ, BF, BD, BG, BH, BS, BA, BL, BY, BZ, BM, BO, BR, BB, BN, BT, BW, BV, CF, CA, CC, CH, CL, CN, CI, CM, CD, CG, CK, CO, KM, CV, CR, CU, CX, KY, CY, CZ, DE, DJ, DM, DK, DO, DZ, EC, EG, ER, EH, ES, EE, TW, ET, LI, FI, FJ, FK, FR, FO, FM, GA, GB, GE, GH, GI, GN, GP, GM, GW, GQ, GR, GD, GL, GT, GU, GF, GY, HK, HM, HN, HR, HT, HU, ID, IN, IO, IE, IR, IQ, IS, IL, IT, JM, JO, JP, KZ, KE, KG, KH, KI, KN, KR, KW, LA, LB, LR, LY, LC, LK, LS, LT, LU, LV, MO, MA, MC, MD, MG, MV, MX, MH, MK, ML, MT, MM, MN, MP, ME, MZ, MR, MS, MQ, MU, MW, MY, YT, NA, NC, NE, NF, NG, NI, NU, NL, NO, NP, NR, NZ, OM, PK, PA, PE, PN, PH, PW, PG, PL, PR, KP, PT, PY, PS, PF, QA, RE, RO, RU, RW, SA, SD, SH, SN, RS, SG, GS, SJ, SB, SL, SV, SM, SO, PM, SS, ST, SR, SK, SI, SE, SZ, SX, SC, SY, TC, TD, TG, TH, TJ, TK, TM, TL, TO, TT, TN, TR, TV, TZ, UG, UA, UM, UY, US, UZ, VA, VC, VE, VG, VI, VN, VU, WF, WS, YE, ZA, ZM, ZW","Direct CI, Life-Cycle CI","CO2","Aggregated single sector","Industry-based","Monetary","EEIOT","(Huo et al. 2026)","Basic"]
["EORA26 v199.82","EORA","1990-2023 (-2017  open access)","AFG, ALB, DZA, AND, AGO, ATG, ARG, ARM, ABW, AUS, AUT, AZE, BHS, BHR, BGD, BRB, BLR, BEL, BLZ, BEN, BMU, BTN, BOL, BIH, BWA, BRA, VGB, BRN, BGR, BFA, BDI, KHM, CMR, CAN, CPV, CYM, CAF, TCD, CHL, CHN, COL, COG, CRI, HRV, CUB, CYP, CZE, CIV, PRK, COD, DNK, DJI, DOM, ECU, EGY, SLV, ERI, EST, ETH, FJI, FIN, FRA, PYF, GAB, GMB, GEO, DEU, GHA, GRC, GRL, GTM, GIN, GUY, HTI, HND, HKG, HUN, ISL, IND, IDN, IRN, IRQ, IRL, ISR, ITA, JAM, JPN, JOR, KAZ, KEN, KWT, KGZ, LAO, LVA, LBN, LSO, LBR, LBY, LIE, LTU, LUX, MAC, MDG, MWI, MYS, MDV, MLI, MLT, MRT, MUS, MEX, MCO, MNG, MNE, MAR, MOZ, MMR, NAM, NPL, NLD, ANT, NCL, NZL, NIC, NER, NGA, NOR, PSE, OMN, PAK, PAN, PNG, PRY, PER, PHL, POL, PRT, QAT, KOR, MDA, ROU, RUS, RWA, WSM, SMR, STP, SAU, SEN, SRB, SYC, SLE, SGP, SVK, SVN, SOM, ZAF, SDS, ESP, LKA, SUD, SUR, SWZ, SWE, CHE, SYR, TWN, TJK, THA, MKD, TGO, TTO, TUN, TUR, TKM, USR, UGA, UKR, ARE, GBR, TZA, USA, URY, UZB, VUT, VEN, VNM, YEM, ZMB, ZWE, ROW","Direct CI, Life-Cycle CI","CO2, N2O, CH4, NF3, SF6, HFCs, CFCs","Aggregated single sector","Industry-based","Monetary","EEIOT","(Lenzenet al, 2013)","Basic"]
["GLORIA v0.60","GLORIA act","1990-2025","XAM, XEU, XAF, XAS, AFG, AGO, ALB, ARE, ARG, ARM, AUS, AUT, AZE, BDI, BEL, BEN, BFA, BGD, BGR, BHR, BHS, BIH, BLR, BLZ, BOL, BRA, BRN, BTN, BWA, CAF, CAN, CHE, CHL, CHN, CIV, CMR, COD, COG, COL, CRI, CUB, CYP, CZE, DEU, DJI, DYE, DNK, DOM, DZA, ECU, EGY, ERI, ESP, EST, ETH, FIN, FRA, GAB, GBR, GEO, GHA, GIN, GMB, GNQ, GRC, GTM, HND, HKG, HRV, HTI, HUN, IDN, IND, IRL, IRN, IRQ, ISL, ISR, ITA, JAM, JOR, JPN, KAZ, KEN, KGZ, KHM, KOR, KWT, LAO, LBN, LBR, LBY, LKA, LTU, LUX, LVA, MAR, MDA, MDG, MEX, MKD, MLI, MLT, MMR, MNG, MOZ, MRT, MWI, MYS, NAM, NER, NGA, NIC, NLD, NOR, NPL, NZL, OMN, PAK, PSE, PAN, PER, PHL, PNG, POL, PRK, PRT, PRY, QAT, ROU, RUS, RWA, SAU, SDS, SEN, SGP, SLE, SLV, SOM, SRB, SDN, SVK, SVN, SWE, SYR, TCD, TGO, THA, TJK, TKM, TUN, TUR, TZA, UGA, UKR, URY, USA, UZB, VEN, VNM, YEM, ZAF, ZMB, ZWE","Direct CI, Life-Cycle CI","CO2, N2O, CH4, NF3, SF6, HFCs","Aggregated single sector","Industry-based","Monetary","EEIOT","(ielab, 2026)","Basic"]
[null,"GLORIA com"]
["GTAP 11","GTAP","2004, 2007, 2011, 2014, 2017","AFG, XAC, ALB, ARE, ARG, ARM, AUS, AUT, AZE, XEC, BEL, BEN, BFA, BGD, BGR, BHR, BLR, BOL, BRA, BRN, BWA, CAF, CAN, CHE, CHL, CHN, CIV, CMR, COD, COG, COL, COM, CRI, CYP, CZE, DEU, DNK, DOM, DZA, ECU, EGY, ESP, EST, ETH, FIN, FRA, GAB, GBR, GEO, GHA, GIN, GNQ, GRC, GTM, HKG, HND, HRV, HTI, HUN, IDN, IND, IRL, IRN, IRQ, ISR, ITA, JAM, JOR, JPN, KAZ, KEN, KGZ, KHM, KOR, KWT, LAO, LBN, LKA, LTU, LUX, LVA, MAR, MDG, MEX, MLI, MLT, MNG, MOZ, MUS, MWI, MYS, NAM, NER, NGA, NIC, NLD, NOR, NPL, NZL, OMN, PAK, PAN, PER, PHL, POL, PRI, PRT, PRY, PSE, QAT, ROU, RUS, RWA, SAU, SDN, SEN, SGP, SLV, SRB, XAC, SVK, SVN, SWE, SWZ, SYR, TCD, TGO, THA, TJK, TTO, TUN, TUR, TWN, TZA, UGA, UKR, URY, USA, UZB, VEN, VNM, XCA, XCB, XEA, XEC, XEE, XEF, XER, XNA, XNF, XOC, XSA, XSC, XSE, XSM, XSU, XTW, XWF, XWS, ZAF, ZMB, ZWE","Direct CI, Life-Cycle CI","CO2, N2O, CH4, NF3, SF6, F-gasses","Aggregated single sector","Industry-based","Monetary","EEIOT","(Aguiar, 2022)","Basic"]
["EMBER 2025","EMBER","2000-2024","AF, AG, AL, AM, AO, AR, AS, AT, AU, AW, AZ, BA, BB, BD, BE, BF, BG, BH, BI, BJ, BM, BN, BO, BR, BS, BT, BW, BY, BZ, CA, CD, CF, CG, CH, CI, CK, CL, CM, CN, CO, CR, CU, CV, CY, CZ, DE, DJ, DK, DM, DO, DZ, EC, EG, EH, ER, ES, ET, FI, FJ, FK, FO, FR, GA, GB, GIB, GD, GE, GF, GH, GI, GL, GM, GN, GP, GQ, GR, GT, GU, GY, HK, HN, HR, HT, HU, ID, IE, IL, IN, IQ, IR, IS, IT, JM, JO, JP, KE, KG, KH, KI, KM, KN, KP, KR, KW, KY, KZ, LA, LB, LC, LD, LI, LK, LR, LS, LT, LU, LV, LY, MA, MD, ME, MG, MK, ML, MM, MN, MO, MQ, MR, MS, MT, MU, MW, MY, MV, MX, MZ, NA, NC, NE, NG, NI, NL, NO, NP, NR, NU, NZ, OM, PA, PE, PF, PG, PH, PK, PL, PM, PNG, PR, PS, PT, PY, QA, RE, RO, RS, RU, RW, SA, SC, SD, SE, SG, SH, SI, SK, SL, SO, SP, SR, SS, ST, SV, SY, SZ, TC, TD, TG, TH, TJ, TL, TM, TN, TO, TR, TT, TW, TZ, UA, UG, US, UY, UZ, VC, VE, VG, VI, VN, VU, WS, XK, YE, ZA, ZM, ZW","Life-Cycle CI","Generic CO2-eq","Coal, Bioenergy, Hydro, Gas, Nuclear, Solar, Wind, Other renewables, Other fossil",null,"Physical","Secondary data","(EMBER, 2025b)","NA"]
["JRC ","JRC","1990-2021","AT, BE, BG, CY, CZ, DE, DK, EE, ES, FI, FR, GR, HR, HU, IE, IT, LT, LU, LV, MT, NL, PL, PT, RO, SE, SI, SK, IS, NO, GB","Direct CI, Life-Cycle CI","CO2, N2O, CH4","Aggregated single sector",null,"Physical","Secondary data","(JRC, 2024)","NA"]
["eGRID","eGRID","2018-2023","US","Direct CI","CO2, N2O, CH4","Aggregated single sector",null,"Physical","Secondary data","(eGrid, 2023)","NA"]