{"text_format":"3","workbook":"xlsx","n_sheets":10,"sheets":["Up in E1 (E1xM1)","Up in M1 (E1xM1)","Up in E2 (E2xM2)","Up in M2 (E2xM2)","Up in E3DO (E3DOxM3)","Up in M3 (E3DOxM3)","Up in E3SU (E3SUxM3)","Up in M3 (E3SUxM3)","Up in E4 (E4xM4)","Up in M4 (E4xM4)"],"not_rendered":{"external_links":2,"defined_names":7},"read":"whole","date_system":"1900"}

{"sheet":"Up in E1 (E1xM1)","index":0,"n_rows":69,"n_cols":15,"rows_kept":69,"merged":[[3,2,3,6],[3,7,3,10],[37,2,37,6],[37,7,37,10]]}
["Additional file 2: Differentially expressed transcripts (DETs) in embryos and megagametophytes at different stages of seed development. "]
["The Arabidopsis genes showing the highest sequence similarity to the Scots pine transcript are presented (#N/A = no alignment to genes in the TAIR database. Cut off value 1e-5)"]
["The highest up-regulated transcripts in E1/M1. Samples subjected to pairwise comparison are highlighted in bold"]
[null,null,"RPKM Embryos ",{"$nulls":4},"RPKM Megagametophytes ",{"$nulls":5},"Arabidopsis homologous gene names and annotation"]
["Transcript ID","Fold change","E1","E2","E3DO","E3SU","E4","M1","M2","M3","M4","At locus ID","At name","At annotation","Involved in"]
["isotig42299",{"v":9.97421329990449,"d":"9.97"},{"$f":"VLOOKUP(A6,'[1]all genes'!$A:$K,3,FALSE)","v":344.004},{"$f":"VLOOKUP(A6,'[1]all genes'!$A:$K,4,FALSE)","v":82.784},{"$f":"VLOOKUP(A6,'[1]all genes'!$A:$K,5,FALSE)","v":93.16},{"$f":"VLOOKUP(A6,'[1]all genes'!$A:$K,6,FALSE)","v":206.886},{"$f":"VLOOKUP(A6,'[1]all genes'!$A:$K,7,FALSE)","v":7.429},{"$f":"VLOOKUP(A6,'[1]all genes'!$A:$K,8,FALSE)","v":0.342},{"$f":"VLOOKUP(A6,'[1]all genes'!$A:$K,9,FALSE)","v":0},{"$f":"VLOOKUP(A6,'[1]all genes'!$A:$K,10,FALSE)","v":0.653},{"$f":"VLOOKUP(A6,'[1]all genes'!$A:$K,11,FALSE)","v":0.734},"No hits"]
["isotig101972",{"v":9.73067847254285,"d":"9.73"},{"$f":"VLOOKUP(A7,'[1]all genes'!$A:$K,3,FALSE)","v":2337.312},{"$f":"VLOOKUP(A7,'[1]all genes'!$A:$K,4,FALSE)","v":1557.12},{"$f":"VLOOKUP(A7,'[1]all genes'!$A:$K,5,FALSE)","v":774.994},{"$f":"VLOOKUP(A7,'[1]all genes'!$A:$K,6,FALSE)","v":1080.524},{"$f":"VLOOKUP(A7,'[1]all genes'!$A:$K,7,FALSE)","v":331.704},{"$f":"VLOOKUP(A7,'[1]all genes'!$A:$K,8,FALSE)","v":2.751},{"$f":"VLOOKUP(A7,'[1]all genes'!$A:$K,9,FALSE)","v":0},{"$f":"VLOOKUP(A7,'[1]all genes'!$A:$K,10,FALSE)","v":0},{"$f":"VLOOKUP(A7,'[1]all genes'!$A:$K,11,FALSE)","v":1.477},"No hits"]
["isotig56640",{"v":8.95973031481398,"d":"8.96"},{"$f":"VLOOKUP(A8,'[1]all genes'!$A:$K,3,FALSE)","v":366.459},{"$f":"VLOOKUP(A8,'[1]all genes'!$A:$K,4,FALSE)","v":151.191},{"$f":"VLOOKUP(A8,'[1]all genes'!$A:$K,5,FALSE)","v":102.056},{"$f":"VLOOKUP(A8,'[1]all genes'!$A:$K,6,FALSE)","v":132.601},{"$f":"VLOOKUP(A8,'[1]all genes'!$A:$K,7,FALSE)","v":21.066},{"$f":"VLOOKUP(A8,'[1]all genes'!$A:$K,8,FALSE)","v":0.736},{"$f":"VLOOKUP(A8,'[1]all genes'!$A:$K,9,FALSE)","v":0.459},{"$f":"VLOOKUP(A8,'[1]all genes'!$A:$K,10,FALSE)","v":0.469},{"$f":"VLOOKUP(A8,'[1]all genes'!$A:$K,11,FALSE)","v":0.527},"No hits"]
["isotig56593",{"v":7.59551179793603,"d":"7.60"},{"$f":"VLOOKUP(A9,'[1]all genes'!$A:$K,3,FALSE)","v":187.22},{"$f":"VLOOKUP(A9,'[1]all genes'!$A:$K,4,FALSE)","v":137.64},{"$f":"VLOOKUP(A9,'[1]all genes'!$A:$K,5,FALSE)","v":88.341},{"$f":"VLOOKUP(A9,'[1]all genes'!$A:$K,6,FALSE)","v":130.891},{"$f":"VLOOKUP(A9,'[1]all genes'!$A:$K,7,FALSE)","v":36.077},{"$f":"VLOOKUP(A9,'[1]all genes'!$A:$K,8,FALSE)","v":0.968},{"$f":"VLOOKUP(A9,'[1]all genes'!$A:$K,9,FALSE)","v":0.907},{"$f":"VLOOKUP(A9,'[1]all genes'!$A:$K,10,FALSE)","v":1.388},{"$f":"VLOOKUP(A9,'[1]all genes'!$A:$K,11,FALSE)","v":1.56},"No hits"]
["isotig39291",{"v":7.17706550112936,"d":"7.18"},{"$f":"VLOOKUP(A10,'[1]all genes'!$A:$K,3,FALSE)","v":209.836},{"$f":"VLOOKUP(A10,'[1]all genes'!$A:$K,4,FALSE)","v":16.905},{"$f":"VLOOKUP(A10,'[1]all genes'!$A:$K,5,FALSE)","v":48.413},{"$f":"VLOOKUP(A10,'[1]all genes'!$A:$K,6,FALSE)","v":0.699},{"$f":"VLOOKUP(A10,'[1]all genes'!$A:$K,7,FALSE)","v":3.752},{"$f":"VLOOKUP(A10,'[1]all genes'!$A:$K,8,FALSE)","v":1.45},{"$f":"VLOOKUP(A10,'[1]all genes'!$A:$K,9,FALSE)","v":0.679},{"$f":"VLOOKUP(A10,'[1]all genes'!$A:$K,10,FALSE)","v":1.386},{"$f":"VLOOKUP(A10,'[1]all genes'!$A:$K,11,FALSE)","v":0.779},"AT4G26880.1",null,"Stigma-specific STIG1-like protein 1 ","unknown"]
{"$rows_left_out":60}
{"sheet":"Up in M1 (E1xM1)","index":1,"n_rows":69,"n_cols":15,"rows_kept":69,"merged":[[3,2,3,6],[3,7,3,10],[37,2,37,6],[37,7,37,10]]}
["Additional file 2: Differentially expressed transcripts (DETs) in embryos and megagametophytes at different stages of seed development. "]
["The Arabidopsis genes showing the highest sequence similarity to the Scots pine transcript are presented (#N/A = no alignment to genes in the TAIR database. Cut off value 1e-5)"]
["The highest up-regulated transcripts in M1/E1. Samples subjected to pairwise comparison are highlighted in bold"]
[null,null,"RPKM Embryos ",{"$nulls":4},"RPKM Megagametophytes ",{"$nulls":5},"Arabidopsis homologous gene names and annotation"]
["Transcript ID","Fold change","E1","E2","E3DO","E3SU","E4","M1","M2","M3","M4","At locus ID","At name","At annotation","Involved in"]
["isotig89204",-6.81314916191854,1.309,21.185,17.765,14.78,26.451,147.198,115.813,149.456,194.321,"AT4G28520.2","CRC","12S seed storage protein CRC","seed maturation; nutrient reservoir activity"]
["isotig96814",-6.65404993703343,1.509,10.682,9.698,7.949,57.309,151.97,104.791,158.734,242.927,"AT1G03880.1","CRB","12S seed storage protein CRB","nutrient reservoir activity; response to ABA"]
["isotig75095",-6.57884263446913,18.252,436.58,296.794,94.556,462.539,1744.775,3192.018,3679.977,4834.673,{"$error":"#N/A"},{"$error":"#N/A"}]
["isotig104606",-6.55624260243997,3.942,25.92,142.208,86.058,269.256,370.973,609.672,716.367,699.314,{"$error":"#N/A"},{"$error":"#N/A"}]
["isotig17379",-6.39979431523284,110.455,1296.884,1045.763,392.882,537.405,9326.43,13142.126,16174.761,14693.908,{"$error":"#N/A"},{"$error":"#N/A"}]
{"$rows_left_out":60}
{"sheet":"Up in E2 (E2xM2)","index":2,"n_rows":69,"n_cols":15,"rows_kept":69,"merged":[[3,2,3,6],[3,7,3,10],[37,2,37,6],[37,7,37,10]]}
["Additional file 2: Differentially expressed transcripts (DETs) in embryos and megagametophytes at different stages of seed development. "]
["The Arabidopsis genes showing the highest sequence similarity to the Scots pine transcript are presented (#N/A = no alignment to genes in the TAIR database. Cut off value 1e-5)"]
["The highest up-regulated transcripts in E2/M2. Samples subjected to pairwise comparison are highlighted in bold"]
[null,null,"RPKM Embryos ",{"$nulls":4},"RPKM Megagametophytes ",{"$nulls":5},"Arabidopsis homologous gene names and annotation"]
["Transcript ID","Fold change","E1","E2","E3DO","E3SU","E4","M1","M2","M3","M4","At locus ID","At name","At annotation","Involved in"]
["isotig56640",8.36366239332128,366.459,151.191,102.056,132.601,21.066,0.736,0.459,0.469,0.527,{"$error":"#N/A"},{"$error":"#N/A"},{"$error":"#N/A"}]
["isotig38581",8.32589615737652,53.73,113.592,69.151,214.241,43.036,0.378,0.354,0.722,2.03,"AT5G09970.1","CYP78A7","Cytochrome P450 78A7 ","regulation of growth"]
["isotig07360",7.71535476063261,71.552,115.799,115.128,326.549,273.941,7.646,0.551,0,3.158,"AT2G18050.1","HIS1-3","histone H1-3 ","nucleosome assembly"]
["isotig60244",7.32670733851707,175.589,119.435,89.067,0.766,9.461,3.577,0.744,0.38,0,"AT4G23560.1","AtGH9B15","Endoglucanase 20 ","cell wall organization"]
["isotig42131",7.32439488253369,24.325,53.852,47.863,51.129,33.015,0,0.336,0,0,"AT3G07010.1",null,"Probable pectate lyase 8 ","pectin catabolic process"]
{"$rows_left_out":60}
{"sheet":"Up in M2 (E2xM2)","index":3,"n_rows":69,"n_cols":15,"rows_kept":69,"merged":[[3,2,3,6],[3,7,3,10],[37,2,37,6],[37,7,37,10]]}
["Additional file 2: Differentially expressed transcripts (DETs) in embryos and megagametophytes at different stages of seed development. "]
["The Arabidopsis genes showing the highest sequence similarity to the Scots pine transcript are presented (#N/A = no alignment to genes in the TAIR database. Cut off value 1e-5)"]
["The highest up-regulated transcripts in M2/E2. Samples subjected to pairwise comparison are highlighted in bold"]
[null,null,"RPKM Embryos ",{"$nulls":4},"RPKM Megagametophytes ",{"$nulls":5},"Arabidopsis homologous gene names and annotation"]
["Transcript ID","Fold change","E1","E2","E3DO","E3SU","E4","M1","M2","M3","M4","At locus ID","At name","At annotation","Involved in"]
["isotig111460",-5.95813475324912,6.428,3.251,41.325,14.516,38.968,102.908,202.113,155.905,272.266,{"$error":"#N/A"}]
["isotig15249",-5.83475337245073,2.522,0.638,0.45,1.424,3.567,16.737,36.413,26.343,54.456,{"$error":"#N/A"}]
["isotig91286",-5.59836816572811,4.059,1.368,3.865,1.018,6.561,54.936,66.277,57.546,118.004,"AT4G28520.1","CRC","12S seed storage protein CRC","seed maturation; nutrient reservoir activity"]
["isotig11912",-5.46149984291552,2.379,0.602,3.398,4.029,4.807,20.435,26.526,23.966,22.944,{"$error":"#N/A"}]
["isotig94827",-5.36455336239723,8.713,1.469,9.335,7.651,14.085,68.04,60.522,58.517,64.549,{"$error":"#N/A"}]
{"$rows_left_out":60}
{"sheet":"Up in E3DO (E3DOxM3)","index":4,"n_rows":69,"n_cols":15,"rows_kept":69,"merged":[[3,2,3,6],[3,7,3,10],[37,2,37,6],[37,7,37,10]]}
["Additional file 2: Differentially expressed transcripts (DETs) in embryos and megagametophytes at different stages of seed development. "]
["The Arabidopsis genes showing the highest sequence similarity to the Scots pine transcript are presented (#N/A = no alignment to genes in the TAIR database. Cut off value 1e-5)"]
["The highest up-regulated transcripts in E3DO/M3. Samples subjected to pairwise comparison are highlighted in bold"]
[null,null,"RPKM Embryos ",{"$nulls":4},"RPKM Megagametophytes ",{"$nulls":5},"Arabidopsis homologous gene names and annotation"]
["Transcript ID","Fold change","E1","E2","E3DO","E3SU","E4","M1","M2","M3","M4","At locus ID","At name","At annotation","Involved in"]
["isotig98833",8.21821636566865,980.78,494.428,351.408,472.717,153.43,0,0,1.18,0,"AT5G23870.2","PAE9","Pectin acetylesterase 9 ","cell wall loosening"]
["isotig60244",7.87274777249436,175.589,119.435,89.067,0.766,9.461,3.577,0.744,0.38,0,"AT4G23560.1","AtGH9B15","Endoglucanase 20 ","cell wall organization"]
["isotig56640",7.76555736463295,366.459,151.191,102.056,132.601,21.066,0.736,0.459,0.469,0.527,{"$error":"#N/A"},{"$error":"#N/A"},{"$error":"#N/A"}]
["isotig66863",7.30356732047478,35.328,76.341,94.628,90.654,41.533,3.135,0.587,0.599,0.673,{"$error":"#N/A"},{"$error":"#N/A"},{"$error":"#N/A"}]
["isotig80888",7.15930409329034,269.835,417.087,373.798,547.779,787.41,21.892,4.271,2.615,10.777,"ATMG00580.1","NAD4","NADH dehydrogenase subunit 4 ","oxidation-reduction process"]
{"$rows_left_out":60}
{"sheet":"Up in M3 (E3DOxM3)","index":5,"n_rows":69,"n_cols":15,"rows_kept":69,"merged":[[3,2,3,6],[3,7,3,10],[37,2,37,6],[37,7,37,10]]}
["Additional file 2: Differentially expressed transcripts (DETs) in embryos and megagametophytes at different stages of seed development. "]
["The Arabidopsis genes showing the highest sequence similarity to the Scots pine transcript are presented (#N/A = no alignment to genes in the TAIR database. Cut off value 1e-5)"]
["The highest up-regulated transcripts in M3/E3DO. Samples subjected to pairwise comparison are highlighted in bold"]
[null,null,"RPKM Embryos ",{"$nulls":4},"RPKM Megagametophytes ",{"$nulls":5},"Arabidopsis homologous gene names and annotation"]
["Transcript ID","Fold change","E1","E2","E3DO","E3SU","E4","M1","M2","M3","M4","At locus ID","At name","At annotation","Involved in"]
["isotig96781",-7.17133421608448,0,9.115,1.073,4.522,4.856,58.64,175.702,154.663,211.613,{"$error":"#N/A"}]
["isotig91944",-6.59464467602581,1.396,16.944,1.994,1.051,14.667,105.737,181.68,192.713,270.443,"AT1G03890.1","CRD","12S seed storage protein CRD ","seed maturation; nutrient reservoir activity"]
["isotig107909",-6.51453073999866,14.282,40.931,3.4,0,0,55.764,127.052,310.848,135.751,{"$error":"#N/A"},{"$error":"#N/A"},{"$error":"#N/A"}]
["isotig108390",-6.27262658967036,30.661,23.26,1.825,7.693,14.456,129.691,132.644,141.095,212.148,{"$error":"#N/A"},{"$error":"#N/A"},{"$error":"#N/A"}]
["isotig83823",-6.1975608777034,6.073,20.884,3.47,7.313,24.541,131.828,255.751,254.672,408.456,"AT1G03890.1","CRD","12S seed storage protein CRD ","seed maturation; nutrient reservoir activity"]
{"$rows_left_out":60}
{"sheet":"Up in E3SU (E3SUxM3)","index":6,"n_rows":69,"n_cols":15,"rows_kept":69,"merged":[[3,2,3,6],[3,7,3,10],[37,2,37,6],[37,7,37,10]]}
["Additional file 2: Differentially expressed transcripts (DETs) in embryos and megagametophytes at different stages of seed development. "]
["The Arabidopsis genes showing the highest sequence similarity to the Scots pine transcript are presented (#N/A = no alignment to genes in the TAIR database. Cut off value 1e-5)"]
["The highest up-regulated transcripts in E3SU/M3. Samples subjected to pairwise comparison are highlighted in bold"]
[null,null,"RPKM Embryos ",{"$nulls":4},"RPKM Megagametophytes ",{"$nulls":5},"Arabidopsis homologous gene names and annotation"]
["Transcript ID","Fold change","E1","E2","E3DO","E3SU","E4","M1","M2","M3","M4","At locus ID","At name","At annotation","Involved in"]
["isotig98833",8.64604607847776,980.78,494.428,351.408,472.717,153.43,0,0,1.18,0,"AT5G23870.2","PAE9","Pectin acetylesterase 9 ","cell wall loosening"]
["isotig42299",8.30753731404795,344.004,82.784,93.16,206.886,7.429,0.342,0,0.653,0.734,{"$error":"#N/A"},{"$error":"#N/A"},{"$error":"#N/A"}]
["isotig38581",8.21302004732223,53.73,113.592,69.151,214.241,43.036,0.378,0.354,0.722,2.03,"AT5G09970.1","CYP78A7","Cytochrome P450 78A7 ","regulation of growth"]
["isotig56640",8.14328801738401,366.459,151.191,102.056,132.601,21.066,0.736,0.459,0.469,0.527,{"$error":"#N/A"},{"$error":"#N/A"},{"$error":"#N/A"}]
["isotig80888",7.71063920234217,269.835,417.087,373.798,547.779,787.41,21.892,4.271,2.615,10.777,"ATMG00580.1","NAD4","NADH dehydrogenase subunit 4 ","oxidation-reduction process"]
{"$rows_left_out":60}
{"sheet":"Up in M3 (E3SUxM3)","index":7,"n_rows":69,"n_cols":15,"rows_kept":69,"merged":[[3,2,3,6],[3,7,3,10],[37,2,37,6],[37,7,37,10]]}
["Additional file 2: Differentially expressed transcripts (DETs) in embryos and megagametophytes at different stages of seed development. "]
["The Arabidopsis genes showing the highest sequence similarity to the Scots pine transcript are presented (#N/A = no alignment to genes in the TAIR database. Cut off value 1e-5)"]
["The highest up-regulated transcripts in M3/E3SU. Samples subjected to pairwise comparison are highlighted in bold"]
[null,null,"RPKM Embryos ",{"$nulls":4},"RPKM Megagametophytes ",{"$nulls":5},"Arabidopsis homologous gene names and annotation"]
["Transcript ID","Fold change","E1","E2","E3DO","E3SU","E4","M1","M2","M3","M4","At locus ID","At name","At annotation","Involved in"]
["isotig92965",-7.93274444810803,13.921,80.261,22.87,2.096,5.626,213.066,359.304,512.136,388.783,{"$error":"#N/A"}]
["isotig91944",-7.51854741646182,1.396,16.944,1.994,1.051,14.667,105.737,181.68,192.713,270.443,"AT1G03890.1","CRD","12S seed storage protein CRD ","seed maturation; nutrient reservoir activity"]
["isotig96258",-7.48760616330673,1.484,31.527,5.301,1.117,13.196,90.403,219.214,200.469,251.446,{"$error":"#N/A"},{"$error":"#N/A"},{"$error":"#N/A"}]
["isotig101116",-6.86419343199273,8.467,8.564,9.676,2.549,1.369,97.854,245.157,296.96,184.628,{"$error":"#N/A"},{"$error":"#N/A"},{"$error":"#N/A"}]
["isotig100342",-6.63194347012521,0,20.52,6.038,1.272,8.198,69.968,142.151,126.154,147.455,"AT1G03890.1","CRD","12S seed storage protein CRD ","seed maturation; nutrient reservoir activity"]
{"$rows_left_out":60}
{"sheet":"Up in E4 (E4xM4)","index":8,"n_rows":69,"n_cols":15,"rows_kept":69,"merged":[[3,2,3,6],[3,7,3,10]]}
["Additional file 2: Differentially expressed transcripts (DETs) in embryos and megagametophytes at different stages of seed development. "]
["The Arabidopsis genes showing the highest sequence similarity to the Scots pine transcript are presented (#N/A = no alignment to genes in the TAIR database. Cut off value 1e-5)"]
["The highest up-regulated transcripts in E4/M4. Samples subjected to pairwise comparison are highlighted in bold"]
[null,null,"RPKM Embryos ",{"$nulls":4},"RPKM Megagametophytes ",{"$nulls":5},"Arabidopsis homologous gene names and annotation"]
["Transcript ID","Fold change","E1","E2","E3DO","E3SU","E4","M1","M2","M3","M4","At locus ID","At name","At annotation","Involved in"]
["isotig04236",10.0245481714154,32.099,162.718,322.59,587.741,978.037,0.874,0,0,0.939,{"$error":"#N/A"},{"$error":"#N/A"},{"$error":"#N/A"}]
["isotig31840",8.26915657962674,0.933,23.587,47.305,59.679,241.252,0.728,0,2.088,0.782,{"$error":"#N/A"},{"$error":"#N/A"},{"$error":"#N/A"}]
["isotig101972",7.81108277328173,2337.312,1557.12,774.994,1080.524,331.704,2.751,0,0,1.477,{"$error":"#N/A"},{"$error":"#N/A"},{"$error":"#N/A"}]
["isotig03831",7.42973967915391,16.25,111.537,99.077,108.775,83.966,4.985,1.273,3.898,0.487,"AT5G67070.1","RALFL34","Protein RALF-like 34 ","cell-cell signaling; hormone activity"]
["isotig43821",7.26152602423421,5.249,8.343,16.068,21.447,48.18,1.171,1.371,0.28,0.314,{"$error":"#N/A"},{"$error":"#N/A"},{"$error":"#N/A"}]
{"$rows_left_out":60}
{"sheet":"Up in M4 (E4xM4)","index":9,"n_rows":69,"n_cols":15,"rows_kept":69,"merged":[[3,2,3,6],[3,7,3,10],[37,2,37,6],[37,7,37,10]]}
["Additional file 2: Differentially expressed transcripts (DETs) in embryos and megagametophytes at different stages of seed development. "]
["The Arabidopsis genes showing the highest sequence similarity to the Scots pine transcript are presented (#N/A = no alignment to genes in the TAIR database. Cut off value 1e-5)"]
["The highest up-regulated transcripts in M4/E4. Samples subjected to pairwise comparison are highlighted in bold"]
[null,null,"RPKM Embryos ",{"$nulls":4},"RPKM Megagametophytes ",{"$nulls":5},"Arabidopsis homologous gene names and annotation"]
["Transcript ID","Fold change","E1","E2","E3DO","E3SU","E4","M1","M2","M3","M4","At locus ID","At name","At annotation","Involved in"]
["isotig99197",-7.53687747120351,19.193,72.803,20.564,13.243,1.293,116.158,187.118,193.358,240.118,{"$error":"#N/A"}]
["isotig100129",-7.13003269577195,6.596,35.029,16.491,8.689,1.333,95.296,346.064,292.888,186.717,{"$error":"#N/A"}]
["isotig101116",-7.07535510655197,8.467,8.564,9.676,2.549,1.369,97.854,245.157,296.96,184.628,{"$error":"#N/A"}]
["isotig111359",-6.69697557958693,0,64.816,22.886,33.764,2.59,72.558,203.814,172.147,268.714,{"$error":"#N/A"}]
["isotig88106",-6.54582993665846,6.461,13.071,7.384,0.973,1.044,71.648,70.866,81.968,97.542,{"$error":"#N/A"}]
{"$rows_left_out":59}