lumenal reduction
type: Class
subclass of: Problem
subclass of: Restriction
  on property: hasSemAttribute
  some values from: DefiniteExistence Certainty
subclass of: Restriction
  on property: hasSemAttribute
  some values from: Overlap DocTimeRel
subclass of: Restriction
  on property: hasSemAttribute
  some values from: Patient Experiencer
alt label: diameter narrowing
alt label: diameter reduction
alt label: flow narrowing
alt label: flow reduction
alt label: lumenal narrowing
pref label: lumenal reduction

filling defect
type: Class
subclass of: Problem
subclass of: Restriction
  on property: hasSemAttribute
  some values from: Overlap DocTimeRel
subclass of: Restriction
  on property: hasSemAttribute
  some values from: DefiniteExistence Certainty
subclass of: Restriction
  on property: hasSemAttribute
  some values from: Patient Experiencer
pref CUI: C0332555
alt label: Filling defect
alt label: Filling defect (finding)
alt label: Filling defect, NOS
alt label: defect filling
alt label: defecto en el llenado
alt label: defecto en el llenado (hallazgo)
alt label: defects filling
alt label: filling defect

aneurysm
type: Class
subclass of: Problem
subclass of: Restriction
  on property: hasSemAttribute
  some values from: Patient Experiencer
subclass of: Restriction
  on property: hasSemAttribute
  some values from: DefiniteExistence Certainty
subclass of: Restriction
  on property: hasSemAttribute
  some values from: Overlap DocTimeRel
subclass of: Restriction
  on property: hasSemAttribute
  some values from: Mild Severity
alt label: ANEVRIZMA
alt label: Aneurysm
pref label: Aneurysm
alt label: Aneurysm (disorder)
alt label: Aneurysm (morphologic abnormality)
alt label: Aneurysm - lesion
alt label: Aneurysm - lesion (qualifier value)
alt label: Aneurysm NOS
alt label: Aneurysm NOS (disorder)
alt label: Aneurysm [Disease/Finding]
alt label: Aneurysm of unspecified site
alt label: Aneurysm, NOS
alt label: Aneurysmal dilatation
alt label: Aneurysmal dilatation, NOS
alt label: Aneurysms
pref CUI: C0002940
definition: Pathological outpouching or sac-like dilatation in the wall of any blood vessel (ARTERIES or VEINS) or the heart (HEART ANEURYSM). It indicates a thin and weakened area in the wall which may later rupture. Aneurysms are classified by location, etiology, or other characteristics.
alt label: Unspecified aneurysm
alt label: Unspecified aneurysm (disorder)
alt label: aneurysm of unspecified site
alt label: aneurysm of unspecified site (diagnosis)
alt label: aneurysmal dilatation
alt label: aneurysms
alt label: aneuryzma
alt label: artery; dilatation

occlusion
type: Class
subclass of: Problem
subclass of: Restriction
  on property: hasSemAttribute
  some values from: Patient Experiencer
subclass of: Restriction
  on property: hasSemAttribute
  some values from: Overlap DocTimeRel
subclass of: Restriction
  on property: hasSemAttribute
  some values from: DefiniteExistence Certainty
alt label: Block
alt label: Block, NOS
definition: Blockage of a passageway.
pref CUI: C0028778
alt label: OBSTRUCTION
alt label: Obstrucción
alt label: Obstrucción NEOM
alt label: Obstructio
alt label: Obstructio k.m.n.
alt label: Obstruction
pref label: Obstruction
alt label: Obstruction (morphologic abnormality)
alt label: Obstruction NOS
alt label: Obstruction, NOS
alt label: Obstrukce
alt label: Obstrukce NOS
alt label: Obstrução
alt label: Occlusion
alt label: Ostruzione NAS
alt label: block
alt label: blocked
alt label: blocks
alt label: bloqueo
alt label: obstrucción
alt label: obstrucción (anomalía morfológica)
alt label: obstructie
alt label: obstruction
alt label: obstructions
alt label: occluded
alt label: occluding
alt label: occlusion
alt label: occlusions
alt label: oclusión
alt label: 閉塞
alt label: 閉塞ＮＯＳ
alt label: ﾍｲｿｸ
alt label: ﾍｲｿｸNOS

stenosis
type: Class
subclass of: Problem
subclass of: Restriction
  on property: hasSemAttribute
  some values from: DefiniteExistence Certainty
subclass of: Restriction
  on property: hasSemAttribute
  some values from: Overlap DocTimeRel
subclass of: Restriction
  on property: hasSemAttribute
  some values from: Patient Experiencer
alt label: Acquired stenosis
pref CUI: C1261287
alt label: CONSTRICTION PATHOL
alt label: Constricción Patológica
alt label: Constrictie, pathologische
alt label: Constriction
alt label: Constriction (qualifier value)
alt label: Constriction, NOS
alt label: Constriction, Pathologic [Disease/Finding]
alt label: Constrição Patológica
alt label: Costrizione patologica
alt label: Einengung
alt label: Estenose
alt label: Estenosis
alt label: Estrechamiento Patológico
alt label: Estreitamento Patológico
alt label: Konstriktion, pathologische
alt label: PATHOL CONSTRICTION
alt label: Pathologic Constriction
alt label: Pathologic Constrictions
alt label: Pathological Constriction
alt label: Pathologische constrictie
alt label: Patologinen konstriktio
alt label: Restringimento
alt label: Rétrécissement
alt label: SDAVLIVANIE PATOLOGICHESKOE
alt label: STENOSIS
alt label: STRICTURE
alt label: Stenose
alt label: Stenoses
alt label: Stenosi
pref label: Stenosis
alt label: Stenosis
alt label: Stenosis (morphologic abnormality)
alt label: Stenosis, NOS
alt label: Stricture
alt label: Stricture (morphologic abnormality)
alt label: Stricture, NOS
alt label: Strictures
alt label: Sténose pathologique
definition: The condition of an anatomical structure's being constricted beyond normal dimensions.
alt label: Verengung
alt label: Zwężenie patologiczne
alt label: abnormal narrowing
alt label: abnormal narrowing of a duct or passage
alt label: constriction
alt label: estenosis
alt label: estenosis (anomalía morfológica)
alt label: estenosis adquirida
alt label: estenosis adquirida (anomalía morfológica)
alt label: estrechez
alt label: estrechez (anomalía morfológica)
alt label: estrechez adquirida
alt label: konstrikce (patologie)
alt label: narrowing
alt label: stenose
alt label: stenoses
alt label: stenosi
alt label: stenosis
alt label: stenóza
alt label: stenózy
alt label: stricture
alt label: strictures
alt label: striktura
alt label: striktury

pseudoaneurysm
type: Class
subclass of: Element
subclass of: Restriction
  on property: hasSemAttribute
  some values from: DefiniteExistence Certainty
alt label: ANEVRIZMA LOZHNAIA
alt label: Aneurisma Falso
alt label: Aneurisma espurio
alt label: Aneurisma espúrio
alt label: Aneurisma falso
alt label: Aneurisma spurio
alt label: Aneurysm, False
alt label: Aneurysm, False [Disease/Finding]
alt label: Aneurysm, falskt
alt label: Aneurysm;false
alt label: Aneurysma spurium
alt label: Aneurysma, falsches
alt label: Aneurysma, vals
alt label: Aneurysmal haematoma
alt label: Aneurysmal hematoma
alt label: Aneurysms, False
pref CUI: C1510412
alt label: Cévní pseudoaneurysma
alt label: Falešné aneurysma
alt label: False Aneurysm
alt label: False Aneurysms
alt label: False aneurysm
alt label: Falskt aneurisme
alt label: Falso Aneurisma
alt label: Falso aneurisma
alt label: Faux anévrisme
alt label: Faux anévrysme
alt label: Nepravé aneurysma
definition: Not an aneurysm but a well-defined collection of blood and CONNECTIVE TISSUE outside the wall of a blood vessel or the heart. It is the containment of a ruptured blood vessel or heart, such as sealing a rupture of the left ventricle. False aneurysm is formed by organized THROMBUS and HEMATOMA in surrounding tissue.
alt label: PSEUDOANEURYSM
alt label: PSEVDOANEVRIZMA
alt label: Pseudaneurisma
alt label: Pseudo-Aneurisma
alt label: Pseudo-anévrisme
alt label: Pseudo-anévrysme
alt label: Pseudo-anévrysme vasculaire
alt label: Pseudoaneurisma
alt label: Pseudoaneurisma vascolare
alt label: Pseudoaneurisma vascular
alt label: Pseudoaneurisme
alt label: Pseudoaneurysm
pref label: Pseudoaneurysm
alt label: Pseudoaneurysm (disorder)
alt label: Pseudoaneurysm (morphologic abnormality)
alt label: Pseudoaneurysma
alt label: Pseudoaneurysms
alt label: Pseudoanévrisme
alt label: Pseudoanévrysme
alt label: Pseudotętniak
alt label: Pulsatile haematoma
alt label: Pulsatile hematoma
alt label: Seudoaneurisma
alt label: Seudoaneurisma vascular
alt label: Spurious aneurysm
alt label: Tętniak rzekomy
alt label: Valeaneurysma
alt label: Vals aneurysma
alt label: Vascular pseudoaneurysm
alt label: Vascularis pseudoaneurysma
alt label: Vaskulaeres Pseudoaneurysma
alt label: aneurisma falso
alt label: aneurysma nepravé
alt label: aneurysma spurium
alt label: boutpouching
alt label: false aneurysm
alt label: hematoma aneurismático
alt label: hematoma pulsátil
alt label: pseudo-aneurysma
alt label: pseudoaneurisma
alt label: pseudoaneurysma
alt label: pseudoaneuryzma
alt label: seudoaneurisma
alt label: seudoaneurisma (anomalía morfológica)
alt label: seudoaneurisma (trastorno)
alt label: vasculair pseudoaneurysma
alt label: Ál-aneurysma
alt label: Álaneurysma

critical plaque
type: Class
subclass of: Element
subclass of: Restriction
  on property: hasSemAttribute
  some values from: Patient Experiencer
subclass of: Restriction
  on property: hasSemAttribute
  some values from: Overlap DocTimeRel
subclass of: Restriction
  on property: hasSemAttribute
  some values from: DefiniteExistence Certainty
pref label: critical plaque

arteritis
type: Class
subclass of: Problem
subclass of: Restriction
  on property: hasSemAttribute
  some values from: DefiniteExistence Certainty
alt label: ARTERIIT
alt label: ARTERIITIS
alt label: Arteria gyulladásos reakciója
alt label: Arterial Inflammation
alt label: Arterial inflammations
alt label: Arterialis gyulladások
alt label: Arterialis gyulladásos reakció
alt label: Arterienentzuendungen
alt label: Arterienentzündung
alt label: Arteriitida
alt label: Arteriitida NOS
alt label: Arteriitida, blíže neurčená
alt label: Arteriitis
alt label: Arteriitis NNB
alt label: Arteriitis, nicht naeher bezeichnet
alt label: Arteriitis, niet gespecificeerd
alt label: Arteriitis, unspezifisch
alt label: Arterite
alt label: Arterite NAS
alt label: Arterite NE
alt label: Arterite non specificata
alt label: Arteritides
alt label: Arteritis
alt label: Arteritis (disorder)
alt label: Arteritis NEOM
alt label: Arteritis NOS
alt label: Arteritis [Disease/Finding]
alt label: Arteritis k.m.n.
alt label: Arteritis no especificada
alt label: Arteritis unspecified
alt label: Arteritis unspecified (disorder)
alt label: Arteritis, NOS
alt label: Arteritis, nem-meghatározott
alt label: Arteritis, unspecified
alt label: Arteritt
alt label: Arteriální záněty
alt label: Artery/capillary disease NOS
alt label: Artärinflammation
alt label: Artérite
alt label: Artérite SAI
alt label: Artérite, non précisée
alt label: Betennelse i arteriene
alt label: Betennelse i pulsårene
pref CUI: C0003860
definition: INFLAMMATION of any ARTERIES.
alt label: Infiammazione arteriosa
alt label: Infiammazioni arteriose
alt label: Inflamaciones de la pared arterial
alt label: Inflamações arteriais
alt label: Inflammation artérielle
alt label: Inflammation of artery
alt label: Inflammation, Arterial
alt label: Inflammations artérielles
alt label: Inflammatory arterial reaction
alt label: Inflammatory artery reaction
alt label: Reacción inflamatoria arterial
alt label: Reacção arterial inflamatória
alt label: Reazione infiammatoria arteriosa
alt label: Réaction artérielle iflammatoire
alt label: Réaction inflammatoire artérielle
alt label: UPALA ARTERIJE
alt label: Valtimotulehdus
alt label: Zapalenie tętnic
alt label: Zánětlivá arteriální reakce
alt label: Zánětlivá reakce arterie
alt label: arteriitida
alt label: arteritida
alt label: arteritis
alt label: arteritis (diagnosis)
alt label: arteritis (trastorno)
alt label: arteritis NAO
alt label: arteritis no especificada
alt label: arteritis no especificada (trastorno)
alt label: artery inflammation
alt label: entzuendliche Arterienreaktion
alt label: inflammatoire arterie reactie
alt label: inflammatoire arteriële reactie

occlusion
type: Class
subclass of: Problem
subclass of: Restriction
  on property: hasSemAttribute
  some values from: DefiniteNegatedExistence Certainty
subclass of: Restriction
  on property: hasSemAttribute
  some values from: Overlap DocTimeRel
subclass of: Restriction
  on property: hasSemAttribute
  some values from: Patient Experiencer
alt label: Block
alt label: Block, NOS
definition: Blockage of a passageway.
pref CUI: C0028778
alt label: OBSTRUCTION
alt label: Obstrucción
alt label: Obstrucción NEOM
alt label: Obstructio
alt label: Obstructio k.m.n.
pref label: Obstruction
alt label: Obstruction
alt label: Obstruction (morphologic abnormality)
alt label: Obstruction NOS
alt label: Obstruction SAI
alt label: Obstruction, NOS
alt label: Obstrukce
alt label: Obstrukce NOS
alt label: Obstruktion
alt label: Obstruktion NNB
alt label: Obstrução
alt label: Obstrução NE
alt label: Occlusion
alt label: Ostruzione
alt label: Ostruzione NAS
alt label: block
alt label: blocked
alt label: blocks
alt label: bloqueo
alt label: obstrucción
alt label: obstrucción (anomalía morfológica)
alt label: obstructie
alt label: obstructie NAO
alt label: obstruction
alt label: obstructions
alt label: occluded
alt label: occluding
alt label: occlusion
alt label: occlusions
alt label: oclusión
alt label: 閉塞
alt label: 閉塞ＮＯＳ
alt label: ﾍｲｿｸ
alt label: ﾍｲｿｸNOS

ulcer
type: Class
subclass of: Problem
subclass of: Restriction
  on property: hasSemAttribute
  some values from: DefiniteExistence Certainty
pref CUI: C0041582
alt label: Fekély
alt label: Fekély k.m.n.
alt label: Geschwür
alt label: Haava
alt label: IAZVY
alt label: Owrzodzenie
alt label: Sykelig sår
alt label: Sår
alt label: ULCER
alt label: ULCERATION
alt label: ULKUS
alt label: Ulcer
pref label: Ulcer
alt label: Ulcer (disorder)
alt label: Ulcer (morphologic abnormality)
alt label: Ulcer - lesion
alt label: Ulcer NOS
alt label: Ulcer [Disease/Finding]
alt label: Ulcer, NOS
alt label: Ulcera
alt label: Ulcera NAS
alt label: Ulcerated
alt label: Ulcerating
alt label: Ulceration
alt label: Ulceration (qualifier value)
alt label: Ulceration, NOS
alt label: Ulcerative
alt label: Ulcerative (qualifier value)
alt label: Ulcerative lesion
alt label: Ulcerative lesion, NOS
alt label: Ulcers
alt label: Ulcus
alt label: Ulcus, NOS
alt label: Ulcère
alt label: Ulcère SAI
alt label: Ulcération
alt label: Ulkus
alt label: Ulkus NNB
alt label: Vřed
alt label: Vřed NOS
alt label: Wrzód
alt label: Zweer
alt label: lesions ulcer
alt label: lesions ulcerative
alt label: lesions ulcers
alt label: lesión ulcerosa
alt label: lesión ulcerosa, SAI
definition: local defect or excavation of the surface of an organ or tissue produced by the sloughing of inflammatory necrotic tissue.
alt label: ulcer
alt label: ulcer lesion
alt label: ulceración
alt label: ulceración (calificador)
alt label: ulceración, SAI
alt label: ulcerate
alt label: ulcerated
alt label: ulcerates
alt label: ulcerating
alt label: ulceration
alt label: ulcerations
alt label: ulcerative
alt label: ulceratives
alt label: ulceroso
alt label: ulceroso (calificador)
alt label: ulcers
alt label: ulcus
alt label: ulcus NAO
alt label: vřed
alt label: Úlcera
alt label: Úlcera NE
alt label: Úlcera NEOM
alt label: úlcera
alt label: úlcera (anomalía morfológica)
alt label: úlcera (trastorno)
alt label: úlcera, SAI
alt label: ЯЗВЫ
alt label: 潰瘍

calcification
type: Class
subclass of: Problem
subclass of: Restriction
  on property: hasSemAttribute
  some values from: Patient Experiencer
alt label: Ablagerung von Kalzium
pref CUI: C0006663
alt CUI: C0175895
alt CUI: C1533591
alt label: CALCIFICATION
alt label: CALCIFICATION PATHOL
alt label: CALCIUM DEPOSIT(S)
alt label: Calcificación Patológica
alt label: Calcificación tisular NEOM
alt label: Calcificatie, pathologische
alt label: Calcification
alt label: Calcification (morphologic abnormality)
alt label: Calcification pathologique
alt label: Calcification tissulaire SAI
alt label: Calcification, NOS
alt label: Calcification, Pathologic
alt label: Calcifications
alt label: Calcificazione patologica
alt label: Calcificazione tessutale NAS
alt label: Calcificação Patológica
alt label: Calcificação dos tecidos NE
alt label: Calcified
alt label: Calcified (qualifier value)
alt label: Calcified (qualifier)
alt label: Calcified structure
alt label: Calcified structure (morphologic abnormality)
alt label: Calcinose
alt label: Calcinoses
alt label: Calcinosi
alt label: Calcinosis
pref label: Calcinosis
alt label: Calcinosis (disorder)
alt label: Calcinosis [Disease/Finding]
alt label: Calcium deposition
alt label: Calcium deposition, NOS
alt label: Calcium deposits
alt label: Calcium depositum
alt label: Calcium depositumok
alt label: DEPOSIT(S), CALCIUM
alt label: Deposit calcium
alt label: Depositi di calcio
alt label: Deposito di calcio
alt label: Depósito de calcio
alt label: Depósito de cálcio
alt label: Depósitos de calcio
alt label: Depósitos de cálcio
alt label: Dépôt calcique
alt label: Dépôts calciques
alt label: Forkalkning, patologisk
alt label: Förkalkning
alt label: Gewebekalzifizierung NNB
alt label: Heterotopic calcification
alt label: KAL'TSIFIKATSIIA PATOLOGICHESKAIA
alt label: KAL'TSINOZ
alt label: KALCINOZA
alt label: Kalcifikace tkáně NOS
alt label: Kalcifikovaná ložiska
alt label: Kalcifikované ložisko
alt label: Kalcinóza
alt label: Kalcynoza
alt label: Kalsinoosi
alt label: Kalsinose
alt label: Kalzifikation, pathologische
alt label: Kalzinose
alt label: Kalziumablagerungen
alt label: Mineralization, NOS
alt label: PATHOL CALCIFICATION
alt label: Pathologic Calcification
alt label: Pathologic calcification
alt label: Pathologic calcification (calcified structure)
alt label: Pathologic calcification, calcified structure
alt label: Pathologic calcification, calcified structure (morphologic abnormality)
definition: Pathologic deposition of calcium salts in tissues. Deposits of calcium in the tissues. Calcification in the breast can be seen on a mammogram, but cannot be detected by touch. There are two types of breast calcification, macrocalcification and microcalcification. Macrocalcifications are large deposits and are usually not related to cancer. Microcalcifications are specks of calcium that may be found in an area of rapidly dividing cells. Many microcalcifications clustered together may be a sign of cancer. Having calcium deposited on or in an anatomic structure.
alt label: Pathologically calcified structure
alt label: Patologisk forkalkning
alt label: Patologisk kalsifikasjon
alt label: Szöveti meszesedés k.m.n.

atheroma
type: Class
subclass of: Problem
subclass of: Restriction
  on property: hasSemAttribute
  some values from: DefiniteExistence Certainty
subclass of: Restriction
  on property: hasSemAttribute
  some values from: Patient Experiencer
subclass of: Restriction
  on property: hasSemAttribute
  some values from: Overlap DocTimeRel
alt label: Aterom
alt label: Ateroma
alt label: Ateromatøse plakk
alt label: Ateromatøst plakk
alt label: Atherom
pref label: Atheroma
alt label: Atheroma
alt label: Atheroma (morphologic abnormality)
alt label: Atheroma of artery
alt label: Atheroma of artery (disorder)
alt label: Atheroma of artery, NOS
alt label: Atheroma, NOS
alt label: Atheromas
alt label: Atheromatoese Plaques
alt label: Atheromatous Plaques
alt label: Atheromatous degeneration
alt label: Atheromatous degeneration (morphologic abnormality)
alt label: Atheromatous plaque
alt label: Atheromatous plaque, NOS
alt label: Atheromatöse Plaques
alt label: Athérome
pref CUI: C0264956
alt label: Plakk, ateromatøse
alt label: Plaques athéromateuses
alt label: Plaques d'athérome
alt label: aterom
alt label: ateroma
alt label: ateroma (anomalía morfológica)
alt label: ateroma arterial
alt label: ateroma arterial (trastorno)
alt label: atheroma
alt label: atheromas
alt label: atheromatous
alt label: atheromatous plaque
alt label: atheroom
alt label: degeneración ateromatosa
alt label: degeneración ateromatosa (anomalía morfológica)
alt label: placa ateromatosa
alt label: アテローム
alt label: ｱﾃﾛｰﾑ

atherosclerotic plaque
type: Class
subclass of: Problem
subclass of: Restriction
  on property: hasSemAttribute
  some values from: DefiniteExistence Certainty
subclass of: Restriction
  on property: hasSemAttribute
  some values from: Patient Experiencer
subclass of: Restriction
  on property: hasSemAttribute
  some values from: Overlap DocTimeRel
alt label: ATEROMA
alt label: ATHEROSCLEROTIC PLAQUE
alt label: Aterosklerotisk plakk
alt label: Aterosklerotiske plakk
alt label: Atherosclerotic Plaque
alt label: Atherosclerotic Plaques
alt label: Atherosklerotische Plaques
alt label: Atherosklerotischer Plaque
alt label: BLIASHKA ATEROSKLEROTICHESKAIA
alt label: Blaszka miażdżycowa
alt label: Blaszki miażdżycowe
pref CUI: C2936350
alt label: FIBROATEROMA
alt label: Placa Aterosclerótica
alt label: Placca aterosclerotica
alt label: Placche aterosclerotiche
alt label: Plak, aterosklerotski
alt label: Plakk, aterosklerotiske
alt label: Plaque athéroscléreuse
alt label: Plaque d'athérosclérose
alt label: Plaque, Atherosclerotic
pref label: Plaque, Atherosclerotic
alt label: Plaque, Atherosclerotic [Disease/Finding]
alt label: Plaque, atherosklerotischer
alt label: Plaques, Atherosclerotic
alt label: Płytka miażdżycowa
alt label: Płytki miażdżycowe
alt label: aterosklerotické pláty
alt label: aterosklerotický plát
alt label: atherosclerotic plaque
alt label: atherosclerotic plaques
alt label: soft plaque
definition: yellowish plaques containing cholesterol, lipoid material, and lipophages formed within the intima and inner media of large and medium-sized arteries in atherosclerosis.
alt label: АТЕРОМА
alt label: БЛЯШКА АТЕРОСКЛЕРОТИЧЕСКАЯ
alt label: ФИБРОАТЕРОМА

vasospasm
type: Class
subclass of: Problem
subclass of: Restriction
  on property: hasSemAttribute
  some values from: DefiniteExistence Certainty
subclass of: Restriction
  on property: hasSemAttribute
  some values from: Patient Experiencer
subclass of: Restriction
  on property: hasSemAttribute
  some values from: Overlap DocTimeRel
alt label: Angioespasmo
alt label: Angiospasm
alt label: Angiospasm, NOS
alt label: Angiospasme
alt label: Angiospasmo
alt label: Angiospasmus
alt label: Blood vessel spasm
pref CUI: C0085616
alt label: Espasmo vascular
alt label: Gefaesskrampf
alt label: Spasme vasculaire
alt label: Spasmo vascolare
alt label: Vascular spasm
alt label: Vascularis görcs
alt label: Vaskulární spasmus
alt label: Vasoespasmo
alt label: Vasospasm
pref label: Vasospasm
alt label: Vasospasm (finding)
alt label: Vasospasm, NOS
alt label: Vasospasme
alt label: Vasospasmo
alt label: Vasospasmus
alt label: Vazospasmus
alt label: angioespasmo
alt label: angiospasm
alt label: angiospasme
alt label: beaded
alt label: beading
alt label: blood spasm vessels
alt label: blood spasms vessel
alt label: blood vessel spasm
alt label: espasmo de un vaso sanguíneo
alt label: espasmo vascular
alt label: spasm
definition: spasm of the blood vessels resulting in decrease in their caliber.
alt label: spasm vascular
alt label: spasm; vascular
alt label: spasme; vasculair
alt label: spasms vascular
alt label: syndrome; vasospastic
alt label: syndroom; vasospastisch
alt label: transient narrowing
alt label: vaatspasme
alt label: vasculair; spasme
alt label: vascular spasm
alt label: vascular; spasm
alt label: vasoespasmo
alt label: vasoespasmo (hallazgo)
alt label: vasospasm
alt label: vasospasms
alt label: vasospastic; syndrome
alt label: vasospastisch; syndroom
alt label: 血管攣縮
alt label: 血管痙攣
alt label: ｹｯｶﾝｹｲﾚﾝ
alt label: ｹｯｶﾝﾚﾝｼｭｸ

fibromuscular dysplasia
type: Class
subclass of: Problem
subclass of: Restriction
  on property: hasSemAttribute
  some values from: DefiniteExistence Certainty
subclass of: Restriction
  on property: hasSemAttribute
  some values from: Patient Experiencer
subclass of: Restriction
  on property: hasSemAttribute
  some values from: Overlap DocTimeRel
definition: An idiopathic, segmental, nonatheromatous disease of the musculature of arterial walls, leading to STENOSIS of small and medium-sized arteries. There is true proliferation of SMOOTH MUSCLE CELLS and fibrous tissue. Fibromuscular dysplasia lesions are smooth stenosis and occur most often in the renal and carotid arteries. They may also occur in other peripheral arteries of the extremity.
alt label: Arterial fibromuscular dysplasia
alt label: Arteriële fibromusculaire dysplasie
pref CUI: C0016052
alt label: Displasia Fibromuscular
alt label: Displasia fibromuscolare
alt label: Displasia fibromuscular
alt label: Dysplasia, Fibromuscular
alt label: Dysplasias, Fibromuscular
alt label: Dysplasie fibro-musculaire
alt label: Dysplasie fibromusculaire
alt label: Dysplasie fibromusculaire artérielle
alt label: Dysplasie fibromusculaire des artères
alt label: Dysplasie, fibromusculaire
alt label: Dysplazja włóknisto-mięśniowa
alt label: FIBROMUSKULARNA DISPLAZIJA
alt label: FIBROMYSHECHNAIA DISPLAZIIA
alt label: FMD - Fibromuscular dysplasia
alt label: Fibrodysplasie
alt label: Fibromusculaire dysplasie
alt label: Fibromuscular Dysplasia
alt label: Fibromuscular Dysplasia [Disease/Finding]
alt label: Fibromuscular Dysplasias
alt label: Fibromuscular dysplasia
alt label: Fibromuscular dysplasia (morphologic abnormality)
alt label: Fibromuscular hyperplasia of arteries NOS
alt label: Fibromuscular hyperplasia of arteries NOS (disorder)
alt label: Fibromuscular hyperplasia of artery
alt label: Fibromuscular hyperplasia of artery (disorder)
alt label: Fibromuscular hyperplasia of artery [Ambiguous]
alt label: Fibromuscularis dysplasia
alt label: Fibromuskulaarinen dysplasia
alt label: Fibromuskulaere Dysplasie
alt label: Fibromuskulaere Dysplasie der Arterien
alt label: Fibromuskulární dysplazie
alt label: Fibromuskulär dysplasi
alt label: Fibromuskuläre Dysplasie
alt label: Fibromuskulær dysplasi
alt label: arterial fibromuscular dysplasia
alt label: displasia fibromuscular
alt label: displasia fibromuscular (anomalía morfológica)
alt label: displasia fibromuscular arterial
alt label: fibromusculaire dysplasie
alt label: fibromuscular arterial hyperplasia
alt label: fibromuscular dysplasia
alt label: fibromuscular hyperplasia of artery
alt label: fibromuscular hyperplasia of artery (diagnosis)
alt label: fibromuskulární dysplazie
alt label: hiperplasia fibromuscular arterial
alt label: hiperplasia fibromuscular arterial (trastorno)
alt label: hiperplasia fibromuscular de las arterias, SAI
alt label: hiperplasia fibromuscular de las arterias, SAI (trastorno)
alt label: ФИБРОМЫШЕЧНАЯ ДИСПЛАЗИЯ
alt label: 線維筋性形成異常
alt label: 동맥섬유근 형성이상증
alt label: ｾﾝｲｷﾝｾｲｹｲｾｲｲｼﾞｮｳ

arteriovenous malformation
type: Class
subclass of: Problem
subclass of: Restriction
  on property: hasSemAttribute
  some values from: DefiniteExistence Certainty
alt label: A-V malformace
alt label: A-V malformatio
alt label: A-V malformation
alt label: A-V-misvorming
alt label: ANEVRIZMA ARTERIOVENOZNAIA VROZHDENNAIA
alt label: ARTERIOVENOZNAIA ANEVRIZMA VROZHDENNAIA
alt label: ARTERIOVENOZNYE MAL'FORMATSII
alt label: ARTERIOVENSKE MALFORMACIJE
alt label: AV - Congenital arteriovenous malformation
alt label: AV-Missbildung
alt label: AVM
alt label: AVM - Congenital arteriovenous malformation
alt label: AVｷｹｲ
definition: Abnormal formation of blood vessels that shunt arterial blood directly into veins without passing through the CAPILLARIES. They usually are crooked, dilated, and with thick vessel walls. A common type is the congenital arteriovenous fistula. The lack of blood flow and oxygen in the capillaries can lead to tissue damage in the affected areas.
alt label: Anomalia arteriovenosa
alt label: Anomalie artérioveineuse
alt label: Anomalía arteriovenosa
alt label: Arterioveneuze misvorming
alt label: Arterioveneuze misvormingen
alt label: Arteriovenosus anomalia
alt label: Arteriovenosus malformatio
alt label: Arteriovenosus malformatiók
alt label: Arteriovenous Malformation
alt label: Arteriovenous Malformations
alt label: Arteriovenous Malformations [Disease/Finding]
alt label: Arteriovenous anomaly
alt label: Arteriovenous malformation
alt label: Arteriovenous malformation (morphologic abnormality)
alt label: Arteriovenous malformation, NOS
alt label: Arteriovenous malformations
alt label: Arteriovenózní anomálie
alt label: Arteriovenózní malformace
alt label: Arteriovenösa missbildningar
alt label: Arteriovenöse Fehlbildungen
alt label: Arteriovenøse misdannelser
pref CUI: C0003857
pref label: Congenital arteriovenous malformation
alt label: Congenital arteriovenous malformation
alt label: Congenital arteriovenous malformation (disorder)
alt label: Malformaciones Arteriovenosas
alt label: Malformaciones arteriovenosas
alt label: Malformación AV
alt label: Malformación arteriovenosa
alt label: Malformacje tętniczo-żylne
alt label: Malformatie, arterioveneuze
alt label: Malformation A-V
alt label: Malformation artério-veineuse
alt label: Malformation artérioveineuse
alt label: Malformation, Arteriovenous
alt label: Malformations artério-veineuses
alt label: Malformations artérioveineuses
alt label: Malformations, Arteriovenous
alt label: Malformazione artero-venosa
alt label: Malformazione arterovenosa
alt label: Malformazioni arterovenose
alt label: Malformação AV
alt label: Malformação arteriovenosa
alt label: Malformações Arteriovenosas
alt label: Malformações arteriovenosas
alt label: Misvorming, arterioveneuze
alt label: Misvormingen, arterioveneuze
alt label: Valtimo-laskimoepämuodostumat
alt label: Wady wrodzone naczyń krwionośnych
alt label: Wrodzone wady naczyń krwionośnych
alt label: a v malformation
alt label: a v malformations
alt label: a-v malformation
alt label: anomalies arteriovenous
alt label: anomalía arteriovenosa
alt label: anomalía arteriovenosa (anomalía morfológica)
alt label: arterioveneus; misvorming
alt label: arterioveneuze misvorming
alt label: arterioveneuze misvormingen
alt label: arteriovenoese Anomalie
alt label: arteriovenoese Missbildung
alt label: arteriovenoese Missbildungen
alt label: arteriovenous anomaly

carotid dissection
type: Class
subclass of: Problem
subclass of: Restriction
  on property: hasSemAttribute
  some values from: Overlap DocTimeRel
subclass of: Restriction
  on property: hasSemAttribute
  some values from: Patient Experiencer
subclass of: Restriction
  on property: hasSemAttribute
  some values from: DefiniteExistence Certainty
alt label: Arteria carotis dissectio
pref CUI: C0338585
alt label: Carotid artery dissection
alt label: Carotid artery dissection (disorder)
alt label: Disección de la arteria carótida
alt label: Disecção da artéria carótida
alt label: Disekce arteria carotis
alt label: Dissect carotid artery
alt label: Dissection de l'artère carotide
alt label: Dissection of carotid artery
alt label: Dissektion der Arteria carotis
alt label: Dissezione della arteria carotide
alt label: arteria carotis dissecans
alt label: carotid artery dissection
alt label: carotid dissection
alt label: disección de la arteria carótida
alt label: disección de la arteria carótida (trastorno)
alt label: dissection carotid artery
alt label: dissection of carotid artery
alt label: dissection of carotid artery (diagnosis)
alt label: 頚動脈解離
alt label: ｹｲﾄﾞｳﾐｬｸｶｲﾘ

internal carotid artery
type: Class
subclass of: AnatomicalSite
subclass of: Restriction
  on property: hasSemAttribute
  some values from: DefiniteExistence Certainty
subclass of: Restriction
  on property: hasSemAttribute
  some values from: Patient Experiencer
subclass of: Restriction
  on property: hasSemAttribute
  some values from: Overlap DocTimeRel
alt label: Arteria Carótida Interna
alt label: Arteria carotidea interna
alt label: Arteria carotis interna
alt label: Arteries, Internal Carotid
alt label: Artery, Internal Carotid
alt label: Artère carotide interne
alt label: Artéria Carótida Interna
definition: Branch of the common carotid artery which supplies the anterior part of the brain, the eye and its appendages, the forehead and nose.
pref CUI: C0007276
alt label: Carotid Arteries, Internal
alt label: Carotid Artery, Internal
alt label: Halsarterie, indre
alt label: Halsartär, inre
abbr label: ICA
alt label: Iekšējā miega artērija
alt label: Indre halsarterie
alt label: Internal Carotid Arteries
alt label: Internal Carotid Artery
alt label: Internal carotid artery
alt label: Internal carotid artery structure
pref label: Internal carotid artery structure
alt label: Internal carotid artery structure (body structure)
alt label: Internal carotid artery, NOS
alt label: KAROTIDNA ARTERIJA, UNUTARNJA
alt label: Miega artērija, iekšējā
alt label: SONNAIA ARTERIIA VNUTRENNIAIA
alt label: Sisempi kaulavaltimo
alt label: Tętnica szyjna wewnętrzna
alt label: arteria carotis interna
alt label: arteria carótida interna
alt label: arteries carotid internal
alt label: artery carotid internal
alt label: carotid internal artery
alt label: estructura de la arteria carótida interna
alt label: estructura de la arteria carótida interna (estructura corporal)
alt label: internal carotid artery
alt label: СОННАЯ АРТЕРИЯ ВНУТРЕННЯЯ

common carotid artery
type: Class
subclass of: AnatomicalSite
subclass of: Restriction
  on property: hasSemAttribute
  some values from: Patient Experiencer
subclass of: Restriction
  on property: hasSemAttribute
  some values from: Overlap DocTimeRel
subclass of: Restriction
  on property: hasSemAttribute
  some values from: DefiniteExistence Certainty
alt label: Arteria Carótida Común
alt label: Arteria carotidea comune
alt label: Arteria carotis communis
alt label: Arteries, Common Carotid
alt label: Artery, Common Carotid
alt label: Artère carotide commune
alt label: Artère carotide primitive
alt label: Artéria Carótida Primitiva
pref CUI: C0162859
alt label: Carotid Arteries, Common
alt label: Carotid Artery, Common
alt label: Carotid artery
alt label: Common Carotid Arteries
alt label: Common Carotid Artery
alt label: Common carotid artery
pref label: Common carotid artery
alt label: Common carotid artery structure
alt label: Common carotid artery structure (body structure)
alt label: Common carotid artery, NOS
alt label: Felles halsarterie
alt label: Halsarterie, felles
alt label: Halsartär, gemensam
alt label: Not Translated[Carotid Artery, Common]
alt label: SONNAIA ARTERIIA OBSHCHAIA
definition: The two principal arteries supplying the structures of the head and neck. They ascend in the neck, one on each side, and at the level of the upper border of the thyroid cartilage, each divides into two branches, the external (CAROTID ARTERY, EXTERNAL) and internal (CAROTID ARTERY, INTERNAL) carotid arteries.
alt label: Trunk of common carotid tree
alt label: Tętnica szyjna wspólna
alt label: Yhteinen kaulavaltimo
alt label: arteria carotis communis
alt label: arteria carótida común
alt label: carotid artery
abbr label: cca
alt label: common carotid artery
alt label: estructura de la arteria carótida común
alt label: estructura de la arteria carótida común (estructura corporal)
alt label: СОННАЯ АРТЕРИЯ ОБЩАЯ

carotid bulb
type: Class
subclass of: AnatomicalSite
subclass of: Restriction
  on property: hasSemAttribute
  some values from: Overlap DocTimeRel
subclass of: Restriction
  on property: hasSemAttribute
  some values from: Patient Experiencer
subclass of: Restriction
  on property: hasSemAttribute
  some values from: DefiniteExistence Certainty
alt label: Bulbe carotidien
pref CUI: C0007281
alt label: Carotid Sinus
alt label: Carotid bulb
alt label: Carotid sinus
alt label: Carotid sinus, NOS
alt label: Carotissinus
alt label: KAROTIDNI SINUS
alt label: KAROTIDNYI SINUS
alt label: Karotissinus
alt label: Kaulavaltimon poukama
alt label: Seio Carotídeo
alt label: Seno Carotídeo
alt label: Seno carotideo
alt label: Sinus caroticus
alt label: Sinus carotidien
alt label: Sinus, Carotid
pref label: Structure of carotid sinus
alt label: Structure of carotid sinus
alt label: Structure of carotid sinus (body structure)
alt label: Zatoka tętnicy szyjnej
alt label: bulb
alt label: bulb carotid
alt label: carotid bulb
alt label: carotid sinus
alt label: estructura de seno carotídeo
alt label: estructura de seno carotídeo (estructura corporal)
alt label: estructura del seno carotídeo
alt label: estructura del seno carotídeo (estructura corporal)
alt label: seno carotídeo
alt label: sinus caroticus
definition: slight dilation in the carotid artery at its bifurcation into the external and internal carotid arteries; it contains baroreceptors (pressure sensors) that when stimulated, will cause a reflex slowing of the heart, vasodilation and a fall in blood pressure.
alt label: КАРОТИДНЫЙ СИНУС

vertebral artery
type: Class
subclass of: AnatomicalSite
subclass of: Restriction
  on property: hasSemAttribute
  some values from: DefiniteExistence Certainty
subclass of: Restriction
  on property: hasSemAttribute
  some values from: Patient Experiencer
subclass of: Restriction
  on property: hasSemAttribute
  some values from: Overlap DocTimeRel
alt label: Arteria Vertebral
alt label: Arteria vertebrale
alt label: Arteria vertebralis
alt label: Arterie vertebrali
alt label: Arteries, Vertebral
alt label: Artery, Vertebral
alt label: Artère vertébrale
alt label: Artères vertébrales
alt label: Artéria Vertebral
pref CUI: C0042559
alt label: Kotartär
alt label: Nikamavaltimo
alt label: POZVONOCHNAIA ARTERIIA
alt label: Structure of vertebral artery
pref label: Structure of vertebral artery
alt label: Structure of vertebral artery (body structure)
definition: The first branch of the SUBCLAVIAN ARTERY with distribution to muscles of the NECK; VERTEBRAE; SPINAL CORD; CEREBELLUM; and interior of the CEREBRUM.
alt label: Tętnica kręgowa
alt label: VA
alt label: VERTEBRAL'NAIA ARTERIIA
alt label: VERTEBRALNA ARTERIJA
alt label: Vertebral Arteries
alt label: Vertebral Artery
alt label: Vertebral artery
alt label: Vertebral artery, NOS
alt label: Vertebralarterie
alt label: Virvelarterie
alt label: arteria vertebral
alt label: arteria vertebralis
alt label: arteries vertebral
alt label: artery vertebral
alt label: estructura de arteria vertebral
alt label: estructura de arteria vertebral (estructura corporal)
alt label: estructura de la arteria vertebral
alt label: estructura de la arteria vertebral (estructura corporal)
alt label: vertebral arteries
alt label: vertebral artery
alt label: vertebrální artérie
alt label: ВЕРТЕБРАЛЬНАЯ АРТЕРИЯ
alt label: ПОЗВОНОЧНАЯ АРТЕРИЯ
alt label: 椎骨動脈

external carotid artery
type: Class
subclass of: AnatomicalSite
subclass of: Restriction
  on property: hasSemAttribute
  some values from: Overlap DocTimeRel
subclass of: Restriction
  on property: hasSemAttribute
  some values from: Patient Experiencer
subclass of: Restriction
  on property: hasSemAttribute
  some values from: DefiniteExistence Certainty
alt label: Arteria Carótida Externa
alt label: Arteria carotidea esterna
alt label: Arteria carotis externa
alt label: Arteries, External Carotid
alt label: Artery, External Carotid
alt label: Artère carotide externe
alt label: Artéria Carótida Externa
definition: Branch of the common carotid artery which supplies the exterior of the head, the face, and the greater part of the neck.
pref CUI: C0007275
alt label: Carotid Arteries, External
alt label: Carotid Artery, External
alt label: Carotid artery.external
abbr label: ECA
alt label: External Carotid Arteries
alt label: External Carotid Artery
alt label: External carotid artery
alt label: External carotid artery structure
pref label: External carotid artery structure
alt label: External carotid artery structure (body structure)
alt label: External carotid artery, NOS
alt label: Halsarterie, ytre
alt label: Halsartär, yttre
alt label: KAROTIDNA ARTERIJA, VANJSKA
alt label: Miega artērija, ārējā
alt label: SONNAIA ARTERIIA NARUZHNAIA
alt label: Tętnica szyjna zewnętrzna
alt label: Ulompi kaulavaltimo
alt label: Ytre halsarterie
alt label: arteria carotis externa
alt label: arteria carótida externa
alt label: estructura de la arteria carótida externa
alt label: estructura de la arteria carótida externa (estructura corporal)
alt label: external carotid arteries
alt label: external carotid artery
alt label: Ārējā miega artērija
alt label: СОННАЯ АРТЕРИЯ НАРУЖНАЯ

brachiocephalic artery
type: Class
subclass of: AnatomicalSite
subclass of: Restriction
  on property: hasSemAttribute
  some values from: DefiniteExistence Certainty
subclass of: Restriction
  on property: hasSemAttribute
  some values from: Overlap DocTimeRel
subclass of: Restriction
  on property: hasSemAttribute
  some values from: Patient Experiencer
alt label: Arm-huvudartär
alt label: Arteria Innominada
alt label: Arteria anonyma
alt label: Arteria innominata
alt label: Arteries, Innominate
alt label: Artery, Innominate
alt label: Artéria Inominada
alt label: Augšdelma un galvas stumbrs
abbr label: BCA
alt label: BEZYMIANNAIA ARTERIIA
alt label: BRAKHIOTSEFAL'NYI STVOL
alt label: Brachiocephalic Artery
alt label: Brachiocephalic Trunk
alt label: Brachiocephalic Trunks
alt label: Brachiocephalic artery
alt label: Brachiocephalic trunk
pref CUI: C0006094
alt label: Halsarmarterien
alt label: Innominate Arteries
alt label: Innominate Artery
alt label: Innominate artery
alt label: Käden ja pään valtimorunko
alt label: PLECHEGOLOVNOI STVOL
alt label: Pień ramienno-głowowy
pref label: Structure of brachiocephalic artery
alt label: Structure of brachiocephalic artery
alt label: Structure of brachiocephalic artery (body structure)
definition: The first and largest artery branching from the aortic arch. It distributes blood to the right side of the head and neck and to the right arm.
alt label: Tronc artériel brachio-céphalique
alt label: Tronc artériel brachiocéphalique
alt label: Tronc brachio-céphalique
alt label: Tronc brachio-céphalique artériel
alt label: Tronc brachiocéphalique
alt label: Tronc brachiocéphalique artériel
alt label: Tronco Braquiocefálico
alt label: Tronco brachiocefalico
alt label: Truncus brachiocephalicus
alt label: Trunk, Brachiocephalic
alt label: Trunks, Brachiocephalic
alt label: [SO]Innominate artery
alt label: arteria anonyma
alt label: arteria braquiocefálica
alt label: arteria innominada
alt label: artery brachiocephalic
alt label: artery innominate
abbr label: bca
alt label: brachiocephalic artery
alt label: brachiocephalic trunk
alt label: estructura de la arteria braquiocefálica
alt label: estructura de la arteria braquiocefálica (estructura corporal)
alt label: estructura del tronco braquiocefálico
alt label: estructura del tronco braquiocefálico (estructura corporal)
alt label: innominate artery
alt label: tronco braquiocefálico
alt label: truncus brachiocephalicus
alt label: БЕЗЫМЯННАЯ АРТЕРИЯ
alt label: БРАХИОЦЕФАЛЬНЫЙ СТВОЛ
alt label: ПЛЕЧЕГОЛОВНОЙ СТВОЛ
alt label: 無名動脈
alt label: 腕頭動脈

subclavian artery
type: Class
subclass of: AnatomicalSite
subclass of: Restriction
  on property: hasSemAttribute
  some values from: DefiniteExistence Certainty
subclass of: Restriction
  on property: hasSemAttribute
  some values from: Patient Experiencer
subclass of: Restriction
  on property: hasSemAttribute
  some values from: Overlap DocTimeRel
alt label: ARTERY, SUBCLAVIAN
alt label: Arteria Subclavia
alt label: Arteria subclavia
alt label: Arteria subclavia (dextra)
alt label: Arteria succlavia
alt label: Arterial tree of upper limb
alt label: Arteries, Subclavian
definition: Artery arising from the brachiocephalic trunk on the right side and from the arch of the aorta on the left side. It distributes to the neck, thoracic wall, spinal cord, brain, meninges, and upper limb.
alt label: Artery, Subclavian
alt label: Artère sous-clavière
alt label: Artère subclavière
alt label: Artéria Subclávia
pref CUI: C0038530
alt label: Kragebeinsarterie
alt label: Kravebensarterie
alt label: Nyckelbensartär
alt label: PODKLIUCHICHNAIA ARTERIIA
abbr label: SCA
alt label: Solisvaltimo
pref label: Structure of subclavian artery
alt label: Structure of subclavian artery
alt label: Structure of subclavian artery (body structure)
alt label: Subclavian Arteries
alt label: Subclavian Artery
alt label: Subclavian arterial tree
alt label: Subclavian artery
alt label: Subclavian artery, NOS
alt label: Tętnica podobojczykowa
alt label: Zematslēgas artērija
alt label: [SO]Subclavian artery
alt label: arteria subclavia
alt label: estructura de arteria subclavia
alt label: estructura de arteria subclavia (estructura corporal)
alt label: estructura de la arteria subclavia
alt label: estructura de la arteria subclavia (estructura corporal)
abbr label: sca
alt label: subclavian arteries
alt label: subclavian artery
alt label: ПОДКЛЮЧИЧНАЯ АРТЕРИЯ

left subclavian artery
type: Class
subclass of: AnatomicalSite
subclass of: Restriction
  on property: hasSemAttribute
  some values from: Patient Experiencer
subclass of: Restriction
  on property: hasSemAttribute
  some values from: Left BodySide
subclass of: Restriction
  on property: hasSemAttribute
  some values from: Overlap DocTimeRel
subclass of: Restriction
  on property: hasSemAttribute
  some values from: DefiniteExistence Certainty
alt label: ARTERY, SUBCLAVIAN
alt label: Arteria Subclavia
alt label: Arteria subclavia
alt label: Arteria subclavia (dextra)
alt label: Arteria succlavia
alt label: Arterial tree of upper limb
alt label: Arteries, Subclavian
definition: Artery arising from the brachiocephalic trunk on the right side and from the arch of the aorta on the left side. It distributes to the neck, thoracic wall, spinal cord, brain, meninges, and upper limb.
alt label: Artery, Subclavian
alt label: Artère sous-clavière
alt label: Artère subclavière
alt label: Artéria Subclávia
pref CUI: C0038530
alt label: Kragebeinsarterie
alt label: Kravebensarterie
alt label: Nyckelbensartär
alt label: PODKLIUCHICHNAIA ARTERIIA
abbr label: SCA
alt label: Solisvaltimo
alt label: Structure of subclavian artery
pref label: Structure of subclavian artery
alt label: Structure of subclavian artery (body structure)
alt label: Subclavian Arteries
alt label: Subclavian Artery
alt label: Subclavian arterial tree
alt label: Subclavian artery
alt label: Subclavian artery, NOS
alt label: Tętnica podobojczykowa
alt label: Zematslēgas artērija
alt label: [SO]Subclavian artery
alt label: arteria subclavia
alt label: estructura de arteria subclavia
alt label: estructura de arteria subclavia (estructura corporal)
alt label: estructura de la arteria subclavia
alt label: estructura de la arteria subclavia (estructura corporal)
abbr label: sca
alt label: subclavian arteries
alt label: subclavian artery
alt label: ПОДКЛЮЧИЧНАЯ АРТЕРИЯ

right subclavian artery
type: Class
subclass of: AnatomicalSite
subclass of: Restriction
  on property: hasSemAttribute
  some values from: Right BodySide
subclass of: Restriction
  on property: hasSemAttribute
  some values from: DefiniteExistence Certainty
subclass of: Restriction
  on property: hasSemAttribute
  some values from: Overlap DocTimeRel
subclass of: Restriction
  on property: hasSemAttribute
  some values from: Patient Experiencer
alt label: ARTERY, SUBCLAVIAN
alt label: Arteria Subclavia
alt label: Arteria subclavia
alt label: Arteria subclavia (dextra)
alt label: Arteria succlavia
alt label: Arterial tree of upper limb
alt label: Arteries, Subclavian
definition: Artery arising from the brachiocephalic trunk on the right side and from the arch of the aorta on the left side. It distributes to the neck, thoracic wall, spinal cord, brain, meninges, and upper limb.
alt label: Artery, Subclavian
alt label: Artère sous-clavière
alt label: Artère subclavière
alt label: Artéria Subclávia
pref CUI: C0038530
alt label: Kragebeinsarterie
alt label: Kravebensarterie
alt label: Nyckelbensartär
alt label: PODKLIUCHICHNAIA ARTERIIA
abbr label: SCA
alt label: Solisvaltimo
pref label: Structure of subclavian artery
alt label: Structure of subclavian artery
alt label: Structure of subclavian artery (body structure)
alt label: Subclavian Arteries
alt label: Subclavian Artery
alt label: Subclavian arterial tree
alt label: Subclavian artery
alt label: Subclavian artery, NOS
alt label: Tętnica podobojczykowa
alt label: Zematslēgas artērija
alt label: [SO]Subclavian artery
alt label: arteria subclavia
alt label: estructura de arteria subclavia
alt label: estructura de arteria subclavia (estructura corporal)
alt label: estructura de la arteria subclavia
alt label: estructura de la arteria subclavia (estructura corporal)
abbr label: sca
alt label: subclavian arteries
alt label: subclavian artery
alt label: ПОДКЛЮЧИЧНАЯ АРТЕРИЯ

bilateral subclavian artery
type: Class
subclass of: AnatomicalSite
subclass of: Restriction
  on property: hasSemAttribute
  some values from: Patient Experiencer
subclass of: Restriction
  on property: hasSemAttribute
  some values from: Bilateral BodySide
subclass of: Restriction
  on property: hasSemAttribute
  some values from: Overlap DocTimeRel
subclass of: Restriction
  on property: hasSemAttribute
  some values from: DefiniteExistence Certainty
alt label: ARTERY, SUBCLAVIAN
alt label: Arteria Subclavia
alt label: Arteria subclavia
alt label: Arteria subclavia (dextra)
alt label: Arteria succlavia
alt label: Arterial tree of upper limb
alt label: Arteries, Subclavian
definition: Artery arising from the brachiocephalic trunk on the right side and from the arch of the aorta on the left side. It distributes to the neck, thoracic wall, spinal cord, brain, meninges, and upper limb.
alt label: Artery, Subclavian
alt label: Artère sous-clavière
alt label: Artère subclavière
alt label: Artéria Subclávia
pref CUI: C0038530
alt label: Kragebeinsarterie
alt label: Kravebensarterie
alt label: Nyckelbensartär
alt label: PODKLIUCHICHNAIA ARTERIIA
alt label: Solisvaltimo
pref label: Structure of subclavian artery
alt label: Structure of subclavian artery
alt label: Structure of subclavian artery (body structure)
alt label: Subclavian Arteries
alt label: Subclavian Artery
alt label: Subclavian arterial tree
alt label: Subclavian artery
alt label: Subclavian artery, NOS
alt label: Tętnica podobojczykowa
alt label: Zematslēgas artērija
alt label: [SO]Subclavian artery
alt label: arteria subclavia
alt label: estructura de arteria subclavia
alt label: estructura de arteria subclavia (estructura corporal)
alt label: estructura de la arteria subclavia
alt label: estructura de la arteria subclavia (estructura corporal)
alt label: subclavian arteries
alt label: subclavian artery
alt label: ПОДКЛЮЧИЧНАЯ АРТЕРИЯ

mild carotid stenosis
type: Class
subclass of: Problem
subclass of: Restriction
  on property: hasSemAttribute
  some values from: DefiniteExistence Certainty
alt label: Arteria carotis stenosis
alt label: Arteria-carotis-Einengung
alt label: Arteria-carotis-Stenose
alt label: Artery Narrowing, Carotid
alt label: Artery Narrowings, Carotid
alt label: Artery Stenoses, Carotid
alt label: Artery Stenosis, Carotid
pref CUI: C0007282
alt label: Carotid Artery Narrowing
alt label: Carotid Artery Narrowings
alt label: Carotid Artery Stenoses
alt label: Carotid Artery Stenosis
alt label: Carotid Stenoses
alt label: Carotid Stenosis
alt label: Carotid Stenosis [Disease/Finding]
alt label: Carotid artery narrowing
alt label: Carotid artery stenosis
alt label: Carotid artery stenosis (disorder)
alt label: Carotisstenose
alt label: Estenose Carotídea
alt label: Estenose da artéria carótida
alt label: Estenose das Carótidas
alt label: Estenosis Carotídea
alt label: Estenosis de la arteria carótida
alt label: Estrechamiento de la Arteria Carótida
alt label: Estreitamento das Artérias Carótidas
alt label: Forkalkning i halskar
alt label: Forsnevring av halspulsåren
alt label: Halsartärförträngning
alt label: KAROTIDNA STENOZA
alt label: KAROTIDNYI STENOZ
alt label: Karotisstenose
alt label: Kaulavaltimon ahtauma
definition: Narrowing or stricture of any part of the CAROTID ARTERIES, most often due to atherosclerotic plaque formation. Ulcerations may form in atherosclerotic plaques and induce THROMBUS formation. Platelet or cholesterol emboli may arise from stenotic carotid lesions and induce a TRANSIENT ISCHEMIC ATTACK; CEREBROVASCULAR ACCIDENT; or temporary blindness (AMAUROSIS FUGAX). (From Adams et al., Principles of Neurology, 6th ed, pp822-3)
alt label: Narrowing, Carotid Artery
alt label: Narrowings, Carotid Artery
alt label: SONNOI ARTERII STENOZ
alt label: Stenose der Arteria carotis
alt label: Stenose van de arteria carotis
alt label: Stenose, carotis-
alt label: Stenoses, Carotid
alt label: Stenoses, Carotid Artery
alt label: Stenosi carotidea
alt label: Stenosi dell'arteria carotide
alt label: Stenosi della arteria carotide
alt label: Stenosis, Carotid
alt label: Stenosis, Carotid Artery
alt label: Stenosis, carotid artery
alt label: Stenosis;artery;carotid
alt label: Stenóza arteria carotis
alt label: Sténose carotidienne
alt label: Sténose de l'artère carotide
alt label: Suženje karotidne arterije
alt label: Zwężenie tętnicy szyjnej
alt label: arteria carotis - stenóza
alt label: arteria carotis stenose
alt label: arteries carotid narrowing
alt label: arteries carotid stenosis
alt label: artery carotid stenosi
alt label: artery carotid stenosis
alt label: carotid artery narrowing
alt label: carotid artery stenosis
alt label: carotid artery stenosis (diagnosis)
alt label: carotid stenoses
alt label: carotid stenosis
alt label: estenosis carotídea
alt label: estenosis carotídea (trastorno)
alt label: estenosis de la arteria carótida
alt label: estrechamiento de la arteria carótida
alt label: stenosis carotid
alt label: stenosis carotid artery
alt label: КАРОТИДНЫЙ СТЕНОЗ
alt label: СОННОЙ АРТЕРИИ СТЕНОЗ
alt label: 狭窄-頚動脈
alt label: 狭窄-頸動脈
alt label: 頚動脈狭窄
alt label: 頚動脈狭窄症